program: Gaussian 09
title: 000223512
version: EM64L-G09RevD.01
frameworkgroup: C1[X(C16H13NO2)]
method: RPBEPBE
basis: SDD
operation: Freq
keyword: #p
keyword: freq=noraman
keyword: PBEPBE/SDD
title: #p freq=noraman PBEPBE/SDD
converged: YES YES NO NO
title: Mulliken charges:
elementType: O O N C C C C C C C C C C C C C C C C H H H H H H H H H H H H H
charge: -0.199898 -0.253981 0.002165 -0.392049 0.495682 0.091659 0.327612 -0.427446 -0.366057 -0.304059 -0.353776 0.334252 -0.378945 -0.358281 -0.223514 -0.219276 -0.239591 -0.171436 -0.536274 0.256474 0.227136 0.271471 0.227521 0.278851 0.257345 0.249112 0.230556 0.231523 0.233149 0.229132 0.228926 0.252018
chargesum: 0.00000
title: Mulliken charges with hydrogens summed into heavy atoms:
elementType: O O N C C C C C C C C C C C C C C C C
charge: -0.199898 -0.253981 0.002165 -0.135574 0.495682 0.091659 0.327612 -0.200311 -0.094586 -0.076538 -0.074925 0.334252 -0.121601 -0.109169 0.007043 0.012247 -0.006442 -0.171436 0.173802
polarizability: 2.42520249e+02 1.31505888e+01 1.75101552e+02 4.79047680e+00 1.79931490e+01 1.42354844e+02
1716.lowfreq: -9.2273 -3.9976 0.0003 0.0006 0.0006 5.8937 19.0691 22.4700 46.0370
frequency: 18.8361 22.1738 46.0223 72.0827 82.5605 95.8935 122.3221 137.9244 168.0664 194.3344 218.1565 253.7427 295.8642 308.0035 316.6888 389.1146 397.9566 402.7355 412.5372 436.8990 487.0988 502.7678 517.4694 589.5214 603.0172 614.1361 627.9034 682.5079 704.6798 744.0045 754.4598 773.5634 808.3189 821.7488 832.2370 852.5238 854.8096 926.4060 930.4860 954.5011 979.6722 980.4391 986.7938 990.9028 997.9400 1000.5692 1021.2494 1029.5622 1083.2259 1112.0210 1119.7491 1158.1607 1169.9363 1175.3616 1181.8674 1190.5671 1194.9024 1244.8743 1246.0894 1293.2633 1312.3889 1335.1341 1372.8529 1384.0743 1432.8336 1438.1271 1442.8824 1469.1404 1471.2970 1479.4778 1500.4412 1557.8870 1584.8077 1595.8654 1608.1358 1622.1520 2202.3312 2971.7120 3022.3270 3065.1982 3114.7844 3130.2216 3135.4071 3140.1221 3150.0607 3151.3005 3151.5591 3167.1769 3169.4832 3175.5430
redmass: 5.7035 3.7475 3.9517 5.3769 5.8941 6.9287 8.0455 4.5382 6.1741 4.1833 1.1791 4.0213 4.4050 5.7528 6.8037 9.1324 5.8898 2.9223 2.9161 7.8536 3.6744 3.9424 3.1701 6.3743 5.4600 6.4771 7.0814 4.7524 1.7607 3.9027 2.7727 3.4072 1.8867 1.7107 4.3153 1.9440 1.3986 1.7336 3.7069 1.3892 1.5795 5.0546 1.3648 6.0358 2.2599 1.5494 2.9012 2.3974 1.6208 1.2583 1.3461 1.3382 1.4717 1.0916 1.3653 1.3622 1.5446 2.3602 2.9856 1.5995 1.3859 1.2738 4.9362 7.9857 2.6177 1.4407 2.1633 1.0496 1.0777 2.2160 2.4507 8.3411 7.6323 6.1423 6.0243 6.6612 12.5861 1.0324 1.0820 1.1045 1.0884 1.0864 1.1003 1.0915 1.0880 1.0962 1.0878 1.1015 1.0958 1.0969
irintensity: 0.2217 0.6792 0.5107 0.1165 0.3405 1.8756 11.8453 3.0319 2.6565 4.5020 0.0521 0.8535 1.1936 1.8355 0.7598 0.7663 0.2042 0.2207 0.2317 10.8074 2.3067 7.3398 14.1108 55.1427 15.4365 1.0580 2.3430 4.2878 54.1552 4.6707 38.0451 13.2257 19.9268 4.7030 8.5577 35.7250 12.9206 23.1371 62.7252 0.5080 5.8520 38.8977 1.1057 1.0939 5.2871 1.3199 17.0509 1.4182 8.6921 0.1729 11.0367 0.4110 107.1821 39.5489 96.3368 4.2167 10.2311 246.8006 126.9524 84.4790 50.0359 3.3679 45.1103 0.7315 0.2468 8.5021 12.0936 15.3148 58.6926 18.6418 33.9974 91.9743 190.4830 8.0363 16.4948 161.0035 10.9531 64.6789 5.7136 38.6961 10.6958 0.1315 20.3817 12.2699 0.4934 20.7907 11.1915 22.2968 13.1435 3.7197
temp: 298.150 k
press: 1.00000 atm
elementType: 8 8 7 6 6 6 6 6 6 6 6 6 6 6 6 6 6 6 6 1 1 1 1 1 1 1 1 1 1 1 1 1
symmnumber: 1
zpe: 642908.7 jmol-1
zpe.correction: 0.244871 hartree
zpe.thermalcorrener: 0.261839 hartree
zpe.thermalcorrenthalpy: 0.262784 hartree
zpe.thermalcorrgfe: 0.197723 hartree
zpe.sumelectzpe: -821.341123 hartree
zpe.sumelectthermal: -821.324154 hartree
zpe.sumelectthermalent: -821.323210 hartree
zpe.sumelectthermalfe: -821.388271 hartree
dipole: -5.9886 -5.3137 0.2311
dipole: 8.0096
quadrupole: -95.6081 -123.4669 -104.0614
quadrupole: -20.7312 -2.9118 2.4172
quadrupole: 12.1040 -15.7548 3.6508 -20.7312 -2.9118 2.4172
hfenergy: -821.5859937 hartree
pointgroup: C01 [X(C16H13N1O2)]
dipole: 2.4960543 -1.8832593 0.3913014 debye
polarizability: 243.0468781|-5.2049423|166.2354283|12.6886778|-22.2467091|150.6943382 unknown
InChI: InChI=1S/C16H13NO2/c1-19-14-9-7-13(8-10-14)16(18)15(11-17)12-5-3-2-4-6-12/h2-10,15H,1H3
charge 0 multiplicity 1
32 atoms
O  -0.58175 1.87996 -1.620959
O  4.870832 -0.643566 0.749844
N  -3.456659 2.816522 0.215522
C  -1.569113 0.940503 0.4093
C  -2.148195 -0.457249 0.098571
C  -0.369912 1.245486 -0.548734
C  0.981018 0.737113 -0.18482
C  -2.257062 -1.429563 1.120844
C  -2.582517 -0.768555 -1.213719
C  1.254881 -0.040891 0.978438
C  2.059984 1.047212 -1.057976
C  3.619879 -0.157767 0.376669
C  2.554721 -0.484161 1.25802
C  3.368783 0.613262 -0.790856
C  -2.788758 -2.707245 0.834851
C  -3.113853 -2.045154 -1.497354
C  -3.216086 -3.018808 -0.475926
C  -2.605428 1.984749 0.28529
C  6.017294 -0.345035 -0.119794
H  -1.218537 0.955333 1.457811
H  -1.942863 -1.188038 2.144289
H  -2.507773 -0.01194 -2.003143
H  0.452889 -0.319038 1.668525
H  1.841384 1.6416 -1.951322
H  2.77665 -1.084205 2.145128
H  4.176458 0.873325 -1.48097
H  -2.873762 -3.453094 1.632781
H  -3.449991 -2.27942 -2.5133
H  -3.629676 -4.008599 -0.698259
H  6.188847 0.745549 -0.191805
H  5.871956 -0.771495 -1.130227
H  6.87626 -0.826494 0.368579
