program: Gaussian 09
title: 000223518
version: EM64L-G09RevD.01
frameworkgroup: C1[X(C21H16Cl2O2)]
method: RPBEPBE
basis: SDD
operation: Freq
keyword: #p
keyword: freq=noraman
keyword: PBEPBE/SDD
title: #p freq=noraman PBEPBE/SDD
converged: YES YES NO NO
title: Mulliken charges:
elementType: Cl Cl O O C C C C C C C C C C C C C C C C C C C C C H H H H H H H H H H H H H H H H
charge: -0.062052 -0.039081 -0.329103 -0.218109 -0.714285 0.532910 0.348984 0.517057 -0.636613 -0.375906 0.249369 -0.359993 -0.821670 -0.441575 -0.366636 -0.204934 -0.209921 -0.116740 0.141532 0.250665 -0.325840 -0.323980 -0.208985 -0.198393 -0.098011 0.232587 0.228935 0.240255 0.248829 0.250830 0.233365 0.268806 0.226308 0.238162 0.252755 0.254554 0.255529 0.275835 0.280525 0.262895 0.261142
chargesum: 0.00000
title: Mulliken charges with hydrogens summed into heavy atoms:
elementType: Cl Cl O O C C C C C C C C C C C C C C C C C C C C C
charge: -0.062052 -0.039081 -0.329103 -0.218109 -0.252764 0.532910 0.348984 0.517057 -0.396358 -0.127077 0.249369 -0.109163 -0.093192 -0.203413 -0.113880 0.049620 0.045608 -0.116740 0.141532 0.250665 -0.050005 -0.043455 0.053911 0.062749 -0.098011
polarizability: 4.04085135e+02 3.22611953e-01 1.94844503e+02 -1.03549906e+01 -1.16745200e+01 1.88825502e+02
1716.lowfreq: -3.7618 0.0010 0.0014 0.0016 1.2780 5.9651 14.1963 16.8661 22.4233
frequency: 13.6911 15.9388 22.1686 31.0127 38.9134 51.8460 76.2734 93.0586 101.6734 126.2678 155.8190 166.1322 193.0483 211.2214 221.4936 250.7930 253.5324 291.7779 296.6412 309.6561 332.6327 348.5159 384.5652 398.5760 410.1457 410.4473 447.2803 461.4732 478.8268 483.4607 501.3087 537.8598 548.1214 597.0465 622.0167 627.6954 647.1090 665.1536 692.7155 703.6947 713.1757 739.4961 741.4383 766.5392 787.5983 802.5712 824.1047 831.9763 840.2195 848.5309 851.8832 889.9552 923.0412 943.4441 958.2089 967.7703 971.4156 980.2373 988.4112 993.9543 999.4382 1002.3990 1025.7160 1048.9995 1070.3513 1073.0562 1101.3713 1106.5389 1109.6788 1153.4887 1175.5026 1183.7196 1184.3010 1191.7070 1208.3530 1238.2401 1248.2570 1284.6855 1290.0427 1291.6970 1308.8960 1376.7459 1377.5087 1379.5241 1396.4228 1397.3502 1398.3189 1414.1263 1459.5448 1463.6519 1471.2264 1476.5395 1479.5610 1493.9302 1578.2068 1587.2961 1594.7331 1597.9591 1601.2548 1619.4402 1638.8895 2971.5528 2982.5102 3017.1372 3064.7189 3091.9392 3114.7762 3126.0821 3136.7362 3137.0831 3156.8644 3164.6708 3166.1609 3167.8678 3170.9150 3177.4281 3187.0251
redmass: 7.8723 9.5141 3.9820 5.5110 4.5481 6.5861 6.9909 9.8376 6.5781 7.1698 3.8946 1.2840 4.5261 3.6560 5.7994 4.8936 5.0681 5.8621 7.4152 4.9277 4.5970 3.3402 5.9488 6.6986 2.9117 2.8852 3.0436 4.0378 3.7536 3.1630 7.4981 3.8493 5.6198 5.4678 7.1378 6.9799 4.9102 4.8514 5.0961 4.5030 4.2199 4.0816 4.2119 3.8247 3.6106 3.1572 1.8169 1.2545 1.2506 1.7212 1.5977 1.4342 2.4314 1.7752 1.3985 1.5062 1.4832 1.3516 1.3643 6.0010 2.5227 2.1889 4.3752 1.5418 2.8271 2.7012 2.7789 1.3646 1.3865 1.5483 1.3479 1.3887 1.1349 1.1639 2.5813 3.5669 2.5010 1.7668 1.4021 1.2572 1.6079 5.5615 5.7389 7.0269 1.2607 3.7825 2.5736 3.0113 1.1669 1.0937 2.1525 1.7172 2.1108 1.6250 8.1870 7.3752 6.6303 6.3040 6.2707 7.1055 11.6389 1.0599 1.0367 1.1003 1.0975 1.0996 1.0913 1.0901 1.0890 1.0895 1.0892 1.0964 1.0895 1.0950 1.0961 1.0970 1.0971
irintensity: 0.1193 0.0332 0.0223 0.1876 0.0031 0.3403 0.0470 1.8164 0.5248 0.3074 1.4312 1.4239 1.2722 4.2458 1.4897 0.7748 0.4682 1.5468 0.4538 5.4214 0.6017 5.3599 8.3071 3.3379 0.0014 0.2695 9.3087 15.7434 6.5699 22.8187 29.0149 5.1699 0.2172 7.8819 2.0862 0.0606 9.4528 21.0714 5.9509 1.0746 1.0261 14.3188 19.2434 10.3397 16.4426 10.9508 68.8652 1.2437 1.3149 17.8189 47.2570 7.1671 0.7170 9.8673 1.6984 2.6108 1.3959 1.0196 0.2194 279.2413 15.2928 29.8336 168.5497 10.8857 89.6597 34.5482 248.4320 7.1203 25.3135 46.3830 176.0875 24.7258 0.0717 31.2052 16.2852 305.7256 13.9953 4.6220 3.0105 2.5480 0.5924 6.2656 0.8131 0.3309 11.2051 19.4999 5.2814 1.8380 19.5831 24.6924 19.7260 69.1469 56.6039 98.3167 4.8200 1.0071 11.6980 105.1172 3.8840 14.3867 169.2053 26.8410 22.7462 10.8519 9.2506 22.0071 17.9651 11.6233 14.9940 3.7445 0.0199 4.9684 1.1198 7.6067 0.5300 3.0319 1.1842
temp: 298.150 k
press: 1.00000 atm
elementType: 17 17 8 8 6 6 6 6 6 6 6 6 6 6 6 6 6 6 6 6 6 6 6 6 6 1 1 1 1 1 1 1 1 1 1 1 1 1 1 1 1
symmnumber: 1
zpe: 804582.6 jmol-1
zpe.correction: 0.306449 hartree
zpe.thermalcorrener: 0.329004 hartree
zpe.thermalcorrenthalpy: 0.329948 hartree
zpe.thermalcorrgfe: 0.249873 hartree
zpe.sumelectzpe: -1878.680344 hartree
zpe.sumelectthermal: -1878.657790 hartree
zpe.sumelectthermalent: -1878.656846 hartree
zpe.sumelectthermalfe: -1878.736921 hartree
dipole: -1.0016 2.8023 -1.0188
dipole: 3.1455
quadrupole: -175.9957 -155.8332 -152.2504
quadrupole: 11.8651 -6.1329 -1.0514
quadrupole: -14.6360 5.5266 9.1094 11.8651 -6.1329 -1.0514
hfenergy: -1878.9867935 hartree
pointgroup: C01 [X(C21H16Cl2O2)]
dipole: 0.3635111 1.180944 0.0689361 debye
polarizability: 402.7555577|3.1125747|200.5106858|-19.9160016|7.9403338|184.4888966 unknown
InChI: InChI=1S/C21H16Cl2O2/c1-14-12-16(13-15-2-7-18(22)8-3-15)4-11-20(14)25-21(24)17-5-9-19(23)10-6-17/h2-12H,13H2,1H3
charge 0 multiplicity 1
41 atoms
Cl -7.637733 -2.873335 0.973061
Cl 8.598875 -0.882882 0.606166
O  1.984417 0.584523 0.264757
O  2.042534 -0.954949 -1.50598
C  -3.667176 1.752403 -0.034189
C  -2.181563 1.398534 0.012899
C  0.084048 1.557339 -0.998606
C  -4.624194 0.593757 0.241624
C  -1.308269 1.826703 -1.015461
C  -1.639071 0.675163 1.105699
C  0.575452 0.827033 0.109883
C  -0.260059 0.391956 1.155998
C  0.992922 2.029496 -2.114183
C  -5.724005 0.760493 1.119249
C  -4.460418 -0.659716 -0.403707
C  -6.647027 -0.285861 1.350095
C  -5.370156 -1.717657 -0.188368
C  -6.454123 -1.511471 0.687374
C  2.633007 -0.32895 -0.598817
C  4.0832 -0.433154 -0.272835
C  4.872757 -1.330051 -1.039124
C  4.684282 0.325982 0.764972
C  6.249415 -1.472551 -0.777291
C  6.061404 0.191994 1.036154
C  6.821635 -0.706362 0.259383
H  -3.895455 2.18014 -1.030883
H  -3.873282 2.559551 0.696868
H  -1.71729 2.391303 -1.863323
H  -2.296499 0.328187 1.910503
H  0.177267 -0.161891 1.992501
H  1.930847 2.459313 -1.717808
H  1.272625 1.184962 -2.771014
H  0.495092 2.795948 -2.731309
H  -5.868754 1.718558 1.633065
H  -3.608781 -0.815458 -1.075678
H  -7.493022 -0.149169 2.029829
H  -5.23849 -2.680987 -0.689665
H  4.392597 -1.908829 -1.834628
H  4.070722 1.014143 1.351688
H  6.865104 -2.161259 -1.362093
H  6.535262 0.771652 1.833099
