program: Gaussian 09
title: 000223511
version: EM64L-G09RevD.01
frameworkgroup: C1[X(C15H16O2)]
method: RPBEPBE
basis: SDD
operation: Freq
keyword: #pfreq=noraman
keyword: PBEPBE/SDD
title: #p freq=noraman PBEPBE/SDD
converged: YES YES NO NO
title: Mulliken charges:
elementType: O O C C C C C C C C C C C C C C C H H H H H H H H H H H H H H H H
charge: -0.462682 -0.268422 -0.218606 -0.629888 0.477383 0.502794 -0.398334 -0.389864 -0.414327 -0.388737 -0.358370 -0.351522 0.318298 -0.227335 -0.228225 -0.242186 -0.538393 0.218779 0.200463 0.238290 0.241471 0.265669 0.228199 0.242898 0.249252 0.236372 0.336076 0.223908 0.226538 0.227828 0.221065 0.243142 0.218466
chargesum: 0.00000
title: Mulliken charges with hydrogens summed into heavy atoms:
elementType: O O C C C C C C C C C C C C C C C
charge: -0.126606 -0.268422 0.000173 -0.191135 0.477383 0.502794 -0.156864 -0.124196 -0.186128 -0.145839 -0.109118 -0.115150 0.318298 -0.003427 -0.001687 -0.014358 0.144281
polarizability: 2.01335245e+02 8.53229158e+00 1.73954148e+02 3.10298222e+01 -8.87677233e+00 1.13245640e+02
1716.lowfreq: -8.1972 -2.7698 0.0003 0.0004 0.0007 12.9963 23.3050 27.5944 46.8130
frequency: 23.1256 27.5359 46.6942 69.4209 87.9857 114.7499 162.7866 179.0292 235.9768 269.6635 272.5928 284.7263 313.3015 340.2225 372.5355 403.8697 413.1659 420.1042 482.5198 506.3843 530.9906 554.1175 596.9364 617.7333 629.5734 697.4690 705.4480 730.3753 755.2132 795.4758 818.7557 819.8917 833.3232 853.3046 908.8081 935.0751 949.7276 967.1596 974.9627 977.1575 990.0586 990.8978 994.7816 1003.4460 1007.5385 1027.0414 1081.3338 1111.8202 1112.9854 1149.0119 1156.5519 1161.9934 1172.3526 1179.2077 1188.0045 1213.2993 1219.8454 1227.9330 1271.9456 1302.3061 1307.0426 1327.5155 1371.6152 1383.4833 1401.1771 1418.6095 1436.9605 1440.5964 1457.0598 1466.7598 1474.2020 1483.9743 1504.8098 1587.6889 1592.7969 1614.1640 1624.9254 2949.9047 2956.5335 2962.2529 3043.0834 3050.8142 3109.6321 3121.7173 3123.1203 3129.9423 3134.2305 3145.5999 3147.4984 3162.9274 3166.0113 3169.8691 3556.8305
redmass: 3.7148 4.5229 4.1659 3.6571 4.6718 3.9257 4.3620 3.6904 1.3171 2.6408 3.5674 2.8430 1.5047 2.2384 5.4966 2.8270 2.9703 4.1339 3.9627 3.2316 4.8479 2.4131 5.2065 6.2785 6.8899 3.4430 1.8369 3.5267 1.9263 4.4968 1.5716 2.6845 1.5309 1.2494 1.5481 1.7329 1.5213 1.3566 1.4276 5.2415 6.4685 7.1030 1.3743 2.8891 2.6959 2.1855 1.6214 1.3378 1.2681 1.2766 1.3511 1.2543 1.0521 1.2333 1.1197 1.7518 2.0150 3.5833 1.2486 1.3144 1.2778 1.2669 3.2835 7.4080 2.4752 2.7801 1.1766 2.1439 1.1121 1.0503 1.0728 2.3322 2.5496 7.1842 6.0394 6.1691 6.4356 1.0848 1.0331 1.0645 1.1038 1.0972 1.0877 1.0992 1.0858 1.0893 1.0913 1.0960 1.0873 1.1015 1.0951 1.0960 1.0659
irintensity: 0.6042 0.0161 0.2736 4.5806 0.3384 1.6828 4.9449 3.3218 0.8427 16.4770 19.2470 10.5375 108.6444 0.0961 4.4980 0.0737 0.4317 1.4514 1.5863 12.6729 25.0195 40.8195 7.3082 0.1992 0.4215 14.3791 40.7416 3.9123 39.7856 6.1854 21.2378 1.5364 72.1893 0.2831 4.3086 9.2385 7.0523 0.4771 2.4029 67.8715 10.8721 33.1875 3.1942 23.0194 5.7929 7.8324 12.2719 6.2593 0.7447 28.4401 2.0209 67.4550 0.2364 66.6189 1.1991 10.2927 14.8555 153.9734 0.9966 14.4880 0.8255 0.1540 37.2771 5.0396 7.9681 5.6401 7.8871 9.8528 7.9517 12.6026 50.0920 15.9355 99.0337 9.9532 1.3671 6.5530 53.6859 38.1694 71.4432 50.3215 50.8435 20.2719 10.5576 27.6892 1.6058 13.7764 14.4883 43.9872 8.2391 20.1525 12.2224 3.1243 7.9433
temp: 298.150 k
press: 1.00000 atm
elementType: 8 8 6 6 6 6 6 6 6 6 6 6 6 6 6 6 6 1 1 1 1 1 1 1 1 1 1 1 1 1 1 1 1
symmnumber: 1
zpe: 706177.1 jmol-1
zpe.correction: 0.268969 hartree
zpe.thermalcorrener: 0.284689 hartree
zpe.thermalcorrenthalpy: 0.285633 hartree
zpe.thermalcorrgfe: 0.224097 hartree
zpe.sumelectzpe: -730.388772 hartree
zpe.sumelectthermal: -730.373052 hartree
zpe.sumelectthermalent: -730.372108 hartree
zpe.sumelectthermalfe: -730.433644 hartree
dipole: 0.6364 0.2679 -1.1181
dipole: 1.3141
quadrupole: -84.0876 -96.3476 -100.1802
quadrupole: 5.3448 12.0221 -0.7548
quadrupole: 9.4509 -2.8091 -6.6418 5.3448 12.0221 -0.7548
hfenergy: -730.6577409 hartree
pointgroup: C01 [X(C15H16O2)]
dipole: -0.2834466 -0.0222622 -0.4318099 debye
polarizability: 195.8449934|16.5578875|168.8218691|-34.9915752|18.0670807|123.8681702 unknown
InChI: InChI=1S/C15H16O2/c1-17-14-9-7-13(8-10-14)15(16)11-12-5-3-2-4-6-12/h2-10,15-16H,11H2,1H3
charge 0 multiplicity 1
33 atoms
O  -0.133093 -3.313995 -0.556425
O  3.977936 1.507708 0.267236
C  -0.579282 -2.009244 -0.026751
C  -1.703607 -1.432917 -0.955097
C  0.65002 -1.117632 0.047238
C  -2.377121 -0.190202 -0.396832
C  0.755961 -0.110552 1.040727
C  1.69414 -1.250432 -0.896096
C  -3.421232 -0.308149 0.558062
C  -1.965136 1.108152 -0.791066
C  1.870042 0.747698 1.086103
C  2.822817 -0.400752 -0.862657
C  2.907739 0.605586 0.131716
C  -4.036859 0.839206 1.10673
C  -2.57877 2.258901 -0.246706
C  -3.616824 2.128831 0.704887
C  5.085353 1.387209 -0.682286
H  -1.005471 -2.139852 0.991634
H  -2.464251 -2.230511 -1.091458
H  -1.251741 -1.233794 -1.943931
H  -0.041082 0.007519 1.784211
H  1.631504 -2.048358 -1.642315
H  -3.76113 -1.305927 0.865329
H  -1.153885 1.215855 -1.520559
H  1.960251 1.526335 1.849498
H  3.620709 -0.536184 -1.599159
H  -0.925781 -3.894527 -0.684524
H  -4.844447 0.729335 1.839632
H  -2.247259 3.254124 -0.563862
H  -4.094738 3.020565 1.125887
H  5.574448 0.396011 -0.609114
H  5.798316 2.173858 -0.394067
H  4.746176 1.555235 -1.723489
