program: Gaussian 09
title: 000223508
version: EM64L-G09RevD.01
frameworkgroup: C1[X(C15H13ClO)]
method: RPBEPBE
basis: SDD
operation: Freq
keyword: #p
keyword: freq=noraman
keyword: PBEPBE/SDD
title: #p freq=noraman PBEPBE/SDD
converged: YES YES NO NO
title: Mulliken charges:
elementType: Cl O C C C C C C C C C C C C C C C H H H H H H H H H H H H H
charge: -0.071834 -0.260392 0.519846 0.522299 -0.323165 -0.331185 -0.371841 -0.413762 0.318170 -0.363290 -0.369493 -0.374572 -0.407946 -0.105175 -0.216411 -0.249876 -0.536775 0.214884 0.216053 0.226722 0.225580 0.251186 0.241246 0.253350 0.226159 0.229558 0.256980 0.223035 0.223105 0.247544
chargesum: 0.00000
title: Mulliken charges with hydrogens summed into heavy atoms:
elementType: Cl O C C C C C C C C C C C C C C C
charge: -0.071834 -0.260392 0.519846 0.522299 -0.108281 -0.115132 -0.145118 -0.188183 0.318170 -0.112104 -0.128247 -0.121222 -0.181787 -0.105175 0.013147 0.007104 0.156908
polarizability: 4.23550594e+02 1.58680643e+00 1.71607098e+02 -5.15869387e-02 8.83294597e-02 7.15148701e+01
1716.lowfreq: -0.0023 -0.0017 -0.0010 4.0496 6.9165 13.9829 24.7012 43.7587 51.7224
frequency: 23.5298 43.7123 51.7118 79.1879 115.6861 157.9180 179.8861 180.1492 183.5215 238.4730 239.9652 260.8558 331.2538 370.9936 387.7308 417.3434 421.5909 437.8548 482.0355 510.9684 520.2563 567.5688 614.3323 635.3249 675.7755 684.5681 734.1163 748.8260 785.3345 809.7130 831.4238 842.0566 863.8271 877.5087 891.9451 905.5155 942.0778 965.7629 973.5997 980.1107 984.6634 985.6516 1000.4637 1073.3657 1093.7815 1112.2179 1114.8998 1158.1279 1179.7108 1180.3560 1201.7352 1230.5041 1250.9347 1289.6837 1296.9731 1310.1211 1328.3357 1375.8080 1388.7380 1420.1824 1432.7036 1436.8266 1468.0817 1469.7215 1473.7679 1505.1171 1562.4297 1572.0893 1599.7852 1621.8648 1644.9805 2962.9461 3052.0434 3090.0679 3103.2139 3120.4285 3128.5095 3135.2538 3139.6043 3148.3281 3156.1060 3161.2356 3168.5488 3176.2838
redmass: 4.1561 4.6818 6.5847 4.0514 3.4908 6.1371 4.2094 6.3729 2.5369 4.0153 1.3258 2.5031 4.8943 4.3794 10.3137 2.9176 5.1666 3.0621 4.3910 2.6121 4.9651 3.9260 6.3045 6.8501 7.3081 2.0197 3.2152 5.4416 1.4744 1.3304 1.5010 5.5070 1.6585 4.3299 1.3860 1.8581 1.4151 1.3445 1.3233 5.8755 1.1835 8.8732 2.6280 2.1446 1.5753 1.2598 1.3895 1.3262 1.1631 1.1789 2.6235 1.9801 1.8316 2.2815 1.4683 1.3967 1.3534 4.7320 4.2512 2.9598 3.6719 1.1811 1.0499 2.4460 1.0774 2.5738 6.2168 6.5351 6.2711 6.3003 5.3825 1.0328 1.1040 1.0909 1.0866 1.0892 1.0996 1.0863 1.0878 1.0924 1.0938 1.0939 1.0963 1.0976
irintensity: 0.3903 0.4753 0.1009 0.5291 4.8556 1.9530 0.3980 0.1116 2.1239 3.6149 0.2656 0.1798 2.0285 0.4744 9.6299 0.0406 1.5801 3.8878 3.6247 16.3840 43.1093 4.2635 1.7293 1.4570 31.7621 34.1619 5.0959 17.5911 30.1879 24.0632 43.6538 8.9102 25.6918 36.7311 1.6659 2.9042 4.6672 8.4923 6.0347 14.7868 48.5968 63.8161 11.6018 26.1974 12.7878 0.1998 12.2106 3.0682 73.0846 83.2296 3.2781 119.8163 187.9392 9.6877 6.4365 0.3579 8.7473 0.3142 3.7131 28.9991 22.1212 11.8300 13.9383 30.0710 68.4330 151.7106 55.1958 42.9329 222.0721 74.7784 6.8784 97.7269 47.3975 3.8308 37.2872 22.8672 22.6744 7.8648 7.7382 6.0427 11.7728 21.3336 8.9138 6.6458
temp: 298.150 k
press: 1.00000 atm
elementType: 17 8 6 6 6 6 6 6 6 6 6 6 6 6 6 6 6 1 1 1 1 1 1 1 1 1 1 1 1 1
symmnumber: 1
zpe: 611711.7 jmol-1
zpe.correction: 0.232989 hartree
zpe.thermalcorrener: 0.248347 hartree
zpe.thermalcorrenthalpy: 0.249291 hartree
zpe.thermalcorrgfe: 0.188577 hartree
zpe.sumelectzpe: -1113.464020 hartree
zpe.sumelectthermal: -1113.448661 hartree
zpe.sumelectthermalent: -1113.447717 hartree
zpe.sumelectthermalfe: -1113.508431 hartree
dipole: -3.9425 2.8021 0.0066
dipole: 4.8368
quadrupole: -93.0264 -96.2979 -113.9887
quadrupole: -0.8267 -0.1001 0.0342
quadrupole: 8.0780 4.8064 -12.8844 -0.8267 -0.1001 0.0342
hfenergy: -1113.6970084 hartree
pointgroup: C01 [X(C15H13Cl1O1)]
dipole: 1.4869841 -1.1721049 0.1905598 debye
polarizability: 422.578353|-10.8563451|170.6953554|12.9085278|-12.2023443|73.3988545 unknown
InChI: InChI=1S/C15H13ClO/c1-17-15-9-7-12(8-10-15)5-6-13-3-2-4-14(16)11-13/h2-11H,1H3
charge 0 multiplicity 1
30 atoms
Cl -5.9720 1.980123 -0.445264
O  5.624164 0.755878 0.075199
C  1.484151 -0.229744 0.057293
C  -2.428587 -0.105067 -0.089003
C  0.060427 -0.588239 0.054315
C  -1.00465 0.26438 -0.087217
C  1.963758 1.109241 -0.090901
C  2.455555 -1.256606 0.2162
C  4.283092 0.352228 0.079746
C  3.334219 1.397995 -0.080546
C  3.839554 -0.984941 0.229627
C  -3.395229 0.933144 -0.240643
C  -2.901658 -1.444499 0.051595
C  -4.764084 0.621381 -0.247782
C  -4.280309 -1.728609 0.041233
C  -5.23904 -0.695979 -0.109159
C  6.646893 -0.28129 0.239129
H  -0.140454 -1.66187 0.181903
H  -0.807769 1.338066 -0.213823
H  1.25525 1.934999 -0.215212
H  2.117484 -2.294077 0.332409
H  3.702938 2.422079 -0.193879
H  4.549739 -1.80742 0.35577
H  -3.06848 1.97253 -0.351217
H  -2.189553 -2.267678 0.168347
H  -4.625774 -2.762475 0.150167
H  -6.311029 -0.911192 -0.118036
H  6.602204 -1.022809 -0.581946
H  6.542566 -0.797402 1.213193
H  7.606519 0.254454 0.203701
