program: Gaussian 09
title: 000223500
version: EM64L-G09RevD.01
frameworkgroup: C1[X(C14H13ClO)]
method: RPBEPBE
basis: SDD
operation: Freq
keyword: #p
keyword: freq=noraman
keyword: PBEPBE/SDD
title: #p freq=noraman PBEPBE/SDD
converged: YES YES NO NO
title: Mulliken charges:
elementType: Cl O C C C C C C C C C C C C C C H H H H H H H H H H H H H
charge: -0.071670 -0.450998 -0.705350 0.386209 0.511507 -0.022617 0.327627 -0.379967 -0.407218 -0.243562 -0.434046 -0.360070 -0.865950 -0.206485 -0.214841 -0.106009 0.212469 0.250826 0.233562 0.231507 0.225297 0.230619 0.270227 0.237973 0.228335 0.250720 0.251604 0.249946 0.370357
chargesum: 0.00000
title: Mulliken charges with hydrogens summed into heavy atoms:
elementType: Cl O C C C C C C C C C C C C C C
charge: -0.071670 -0.080641 -0.242056 0.386209 0.511507 -0.022617 0.327627 -0.146405 -0.175711 -0.018265 -0.203427 -0.089843 -0.148921 0.045118 0.035105 -0.106009
polarizability: 2.09079545e+02 9.30064986e+00 1.58529816e+02 1.75245008e+00 -1.66155257e+00 1.09621929e+02
1716.lowfreq: -7.1182 -4.2734 -0.0029 -0.0025 -0.0016 5.4448 18.9090 34.2471 41.6632
frequency: 18.4781 34.1005 41.6452 100.2563 137.0883 159.4949 179.6238 214.4863 270.1389 279.1815 294.0396 301.8370 311.5166 365.9436 384.2167 409.4511 462.6752 475.0516 498.7479 523.9586 537.4083 570.5323 626.0101 636.0575 666.1765 713.1809 746.4064 773.7729 797.6421 812.1633 831.0513 843.5879 899.7011 908.7422 931.3805 954.2153 967.2274 971.9510 999.7651 1002.4273 1041.6750 1071.3936 1081.7516 1103.8926 1153.8694 1164.9349 1177.8958 1183.8806 1201.7586 1210.6907 1267.7066 1292.0491 1295.3655 1307.0898 1375.7673 1388.6491 1396.3127 1399.2957 1444.8938 1462.2845 1465.1533 1477.2419 1479.1709 1489.8830 1587.1427 1597.5834 1603.1021 1622.7842 2951.0057 3003.8714 3019.7079 3061.1179 3086.9232 3122.1500 3126.9547 3129.5362 3145.1352 3160.0805 3166.7781 3170.2534 3581.7070
redmass: 4.0091 5.8285 5.0241 6.0335 5.0955 1.0886 6.8009 2.8525 4.0715 4.2418 6.0175 2.8271 1.2757 2.4331 6.3327 2.9138 3.3541 3.9747 3.5594 4.5030 3.6291 5.4540 6.7194 4.8589 4.8785 3.8694 2.9970 1.7041 2.0217 4.9856 1.2910 1.9274 1.8935 1.5494 1.9228 1.4300 1.3452 1.3589 3.7174 1.9387 1.5111 2.6708 1.8595 1.3894 1.2536 1.7618 1.2492 1.1923 2.6032 2.1938 1.9949 1.6580 1.3511 1.4453 7.0503 3.7547 2.6087 1.4197 2.1687 2.4053 1.2158 1.9201 1.0565 1.4098 7.4058 6.1722 6.1871 7.0578 1.0407 1.0594 1.0973 1.1023 1.0944 1.0863 1.0898 1.0920 1.0892 1.0989 1.0954 1.0965 1.0654
irintensity: 0.0466 0.1736 0.0787 1.1394 0.1159 0.2173 1.0648 4.3145 0.2444 0.3095 1.5549 19.2923 99.3602 6.3505 14.1869 0.0842 10.3428 3.3361 12.0761 4.1308 1.2664 12.4523 0.5402 13.2534 1.9475 3.0477 15.4575 69.6160 29.8625 13.9409 0.7546 31.5142 3.0747 1.1243 21.9100 0.9621 0.6785 0.4385 35.6170 11.8977 6.3364 30.6547 19.1810 31.3048 85.9682 43.1006 15.3146 1.5215 1.9781 7.6249 9.3159 4.2172 5.1570 3.8670 0.2069 3.3188 7.9293 25.3419 26.9569 15.0498 34.8635 83.8524 21.4147 15.4667 1.3502 2.4943 6.8217 1.4837 37.4622 26.0377 22.5678 5.7575 13.4445 0.1933 11.4500 25.7270 0.5705 24.2860 8.2126 1.6008 29.5221
temp: 298.150 k
press: 1.00000 atm
elementType: 17 8 6 6 6 6 6 6 6 6 6 6 6 6 6 6 1 1 1 1 1 1 1 1 1 1 1 1 1
symmnumber: 1
zpe: 596456.7 jmol-1
zpe.correction: 0.227178 hartree
zpe.thermalcorrener: 0.241915 hartree
zpe.thermalcorrenthalpy: 0.242859 hartree
zpe.thermalcorrgfe: 0.183495 hartree
zpe.sumelectzpe: -1075.441778 hartree
zpe.sumelectthermal: -1075.427042 hartree
zpe.sumelectthermalent: -1075.426098 hartree
zpe.sumelectthermalfe: -1075.485462 hartree
dipole: -4.2028 -0.5384 0.3363
dipole: 4.2505
quadrupole: -101.9303 -87.5099 -103.1976
quadrupole: 11.3328 4.4662 -0.1728
quadrupole: -4.3844 10.0360 -5.6516 11.3328 4.4662 -0.1728
hfenergy: -1075.6689566 hartree
pointgroup: C01 [X(C14H13Cl1O1)]
dipole: -1.6378534 -0.2825588 0.1846535 debye
polarizability: 208.5113976|10.8185889|158.3716168|-2.2589223|5.8305584|110.3482753 unknown
InChI: InChI=1S/C14H13ClO/c1-10-3-2-4-12(14(10)16)9-11-5-7-13(15)8-6-11/h2-8,16H,9H2,1H3
charge 0 multiplicity 1
29 atoms
Cl 5.294616 -0.386478 -1.392081
O  -1.608857 -1.804922 1.047496
C  -0.065992 0.523314 1.551988
C  -1.275232 0.543871 0.61931
C  1.261943 0.301142 0.824649
C  -2.036469 -0.629044 0.382843
C  -3.167903 -0.643502 -0.479544
C  -1.670472 1.729948 -0.04336
C  -3.527468 0.565571 -1.119812
C  -2.785901 1.749304 -0.908456
C  2.250571 1.315386 0.786327
C  1.53138 -0.931333 0.172639
C  -3.951433 -1.926154 -0.701775
C  3.480588 1.119115 0.114727
C  2.752384 -1.147752 -0.502113
C  3.709331 -0.114105 -0.520816
H  -0.020692 1.482198 2.100039
H  -0.209258 -0.279116 2.297964
H  -1.091719 2.645996 0.125474
H  -4.395454 0.574152 -1.789706
H  -3.076931 2.677053 -1.411895
H  2.066453 2.273364 1.287436
H  0.778334 -1.726118 0.201333
H  -3.329456 -2.722787 -1.157829
H  -4.381715 -2.327835 0.23916
H  -4.798659 -1.749717 -1.384621
H  4.239792 1.906349 0.09028
H  2.957096 -2.09981 -1.000753
H  -2.25628 -2.539486 0.907594
