program: Gaussian 09
title: 000223517
version: EM64L-G09RevD.01
frameworkgroup: C1[X(C21H16Cl2O2)]
method: RPBEPBE
basis: SDD
operation: Freq
keyword: #p
keyword: freq=noraman
keyword: PBEPBE/SDD
title: #p freq=noraman PBEPBE/SDD
converged: YES YES NO NO
title: Mulliken charges:
elementType: Cl Cl O O C C C C C C C C C C C C C C C C C C C C C H H H H H H H H H H H H H H H H
charge: -0.071971 -0.038974 -0.329989 -0.218519 -0.677077 0.497615 0.337606 0.556876 -0.536578 -0.441765 0.256638 -0.361690 -0.823633 -0.338035 -0.359140 -0.237298 -0.242646 -0.233249 0.140390 0.251051 -0.326161 -0.323858 -0.208945 -0.198249 -0.098189 0.245091 0.244787 0.249451 0.241827 0.250726 0.267637 0.233123 0.229283 0.259175 0.255921 0.233245 0.234996 0.275730 0.280764 0.262788 0.261247
chargesum: 0.00000
title: Mulliken charges with hydrogens summed into heavy atoms:
elementType: Cl Cl O O C C C C C C C C C C C C C C C C C C C C C
charge: -0.071971 -0.038974 -0.329989 -0.218519 -0.187200 0.497615 0.337606 0.556876 -0.287126 -0.199938 0.256638 -0.110964 -0.093590 -0.338035 -0.099965 0.018624 -0.009401 0.001747 0.140390 0.251051 -0.050431 -0.043094 0.053842 0.062997 -0.098189
polarizability: 4.05684171e+02 -2.08047596e+00 2.23030745e+02 9.16097413e+00 5.83866321e+00 1.51035788e+02
1716.lowfreq: -11.7623 -5.8545 -1.8745 -0.0009 0.0004 0.0015 3.5157 16.1814 18.9226
frequency: -4.4793 15.3688 18.8690 26.9064 38.7172 57.7847 74.8633 93.3953 108.8462 134.7439 136.2240 145.8162 183.8342 207.5661 221.2064 228.6054 252.3934 274.7601 296.8405 307.9642 332.1847 373.1461 390.6999 404.0658 409.5864 434.4760 443.8023 454.9029 477.2397 500.7991 502.7645 537.9218 549.5630 560.1217 622.0599 622.8807 665.0216 668.7285 693.4251 703.8766 710.3960 736.5804 740.0581 758.2128 776.0280 786.7988 807.4159 839.7054 843.6994 851.7341 862.5556 896.3844 926.7740 942.4463 952.9354 962.1987 979.8151 987.8377 989.3670 994.1101 1006.8230 1012.3651 1025.6751 1039.7197 1048.1164 1070.7743 1102.1955 1109.7629 1120.5936 1149.3661 1170.8406 1176.4423 1184.3481 1193.2918 1200.6225 1238.6614 1248.9544 1265.9844 1286.3638 1290.8853 1315.1480 1374.6894 1376.6175 1379.3187 1396.7097 1397.8766 1411.4971 1423.8048 1454.7448 1462.6491 1466.7421 1471.0208 1475.0117 1493.5411 1573.8697 1578.0072 1594.2815 1598.4346 1605.4688 1619.9813 1638.4536 2981.6047 2982.8787 3032.6034 3064.0005 3093.6277 3122.6085 3132.5556 3133.8990 3146.3057 3156.7893 3159.9935 3165.7958 3166.1354 3174.2249 3177.5455 3187.6305
redmass: 6.6764 6.6121 7.8057 5.9305 3.8131 7.1813 5.7603 9.4213 7.6874 1.6798 2.3922 3.7395 8.3181 3.4210 4.9240 5.9113 6.4052 2.4693 7.7003 4.5242 6.4357 6.3972 8.2249 6.4665 2.9121 2.9858 3.0752 3.5255 3.5490 6.0184 4.4871 4.5114 5.4748 5.8137 5.7532 6.3737 4.9198 5.7538 4.5655 4.3439 4.6042 4.5154 3.8534 1.2643 4.4696 3.6689 4.8068 1.2545 1.7157 1.5966 1.3153 1.4541 1.9604 2.2857 1.3997 1.5634 1.3526 1.3647 1.3397 5.9952 1.5956 7.0055 4.4053 2.1591 1.5436 2.8207 2.7786 1.3947 1.7594 1.6160 1.0928 1.2330 1.3524 1.2616 2.0529 3.5827 2.3724 1.5942 1.4968 1.2509 1.8428 5.7567 5.4367 6.8973 1.2536 3.9310 2.9908 2.1648 1.4828 1.1171 1.5931 1.9782 1.7749 1.6299 6.0399 8.1807 6.8251 6.2857 6.9970 7.0270 11.5829 1.0618 1.0369 1.0974 1.0974 1.0995 1.0915 1.0895 1.0857 1.0904 1.0892 1.0953 1.0959 1.0896 1.0999 1.0970 1.0969
irintensity: 0.1930 0.4748 0.3386 0.1574 0.0351 0.1083 0.0770 1.8901 0.2106 1.0956 0.6580 0.0712 6.0484 4.3578 2.8118 1.5258 0.1757 2.6697 0.4243 1.8171 0.8200 9.1307 3.3372 5.5657 0.0119 13.1266 8.4419 2.5784 9.0045 19.7272 5.1242 4.0545 2.0695 4.4693 1.2141 6.0003 18.0040 16.7038 3.9345 13.7442 2.0171 11.0689 19.1419 82.7752 2.5721 5.6861 2.4001 1.8893 34.0448 48.4640 0.8157 7.7555 6.6997 0.7856 0.5189 2.3856 0.9180 0.0957 0.5749 269.0193 3.5681 66.6332 167.1067 11.0945 10.2753 88.5608 243.6410 28.4831 2.2629 65.0447 21.9161 126.9834 30.3961 33.9238 13.5002 318.6290 3.4878 2.0813 5.3697 2.2700 0.1456 4.3529 5.3681 2.0249 11.5038 18.5352 1.8855 18.9744 52.0517 22.3336 8.2997 9.5125 37.0801 105.2174 16.9061 6.1427 1.2304 113.9430 2.9730 14.2200 167.5761 13.4352 18.7344 6.5427 9.1929 21.5326 12.6245 13.6935 0.9522 8.4183 0.0204 12.4644 6.3277 1.3034 14.9192 3.0517 1.1037
temp: 298.150 k
press: 1.00000 atm
elementType: 17 17 8 8 6 6 6 6 6 6 6 6 6 6 6 6 6 6 6 6 6 6 6 6 6 1 1 1 1 1 1 1 1 1 1 1 1 1 1 1 1
symmnumber: 1
zpe: 804158.9 jmol-1
zpe.correction: 0.306288 hartree
zpe.thermalcorrener: 0.328017 hartree
zpe.thermalcorrenthalpy: 0.328961 hartree
zpe.thermalcorrgfe: 0.252130 hartree
zpe.sumelectzpe: -1878.680650 hartree
zpe.sumelectthermal: -1878.658921 hartree
zpe.sumelectthermalent: -1878.657977 hartree
zpe.sumelectthermalfe: -1878.734808 hartree
dipole: -0.3927 0.2529 -0.1892
dipole: 0.5039
quadrupole: -166.0826 -151.4225 -155.7765
quadrupole: 9.6435 -1.1690 2.6368
quadrupole: -8.3221 6.3380 1.9840 9.6435 -1.1690 2.6368
hfenergy: -1878.9869378 hartree
pointgroup: C01 [X(C21H16Cl2O2)]
dipole: 0.1468736 -0.1285196 -0.0348966 debye
polarizability: 404.1150088|-16.9153618|210.6452257|-12.7926328|-28.0809925|164.9904691 unknown
InChI: InChI=1S/C21H16Cl2O2/c1-14-12-15(13-17-4-2-3-5-19(17)23)6-11-20(14)25-21(24)16-7-9-18(22)10-8-16/h2-12H,13H2,1H3
charge 0 multiplicity 1
41 atoms
Cl -6.72077 2.133767 0.033272
Cl 8.614113 -0.264738 -0.170933
O  1.906124 0.659565 -0.574436
O  1.856229 -1.461372 0.428911
C  -3.818815 1.339269 -0.902011
C  -2.313877 1.127541 -0.810471
C  -0.264581 0.970404 0.586263
C  -4.668255 0.2254 -0.287048
C  -1.661335 1.151046 0.448658
C  -1.532628 0.924202 -1.973468
C  0.47177 0.759501 -0.607487
C  -0.135864 0.742423 -1.874462
C  0.407779 1.00483 1.942836
C  -5.993851 0.449805 0.157185
C  -4.182506 -1.104838 -0.173807
C  -6.810694 -0.563704 0.693791
C  -4.978062 -2.143546 0.355721
C  -6.294809 -1.875406 0.793005
C  2.508795 -0.497634 -0.028393
C  3.994643 -0.400694 -0.08148
C  4.749787 -1.495853 0.413895
C  4.662219 0.73742 -0.604656
C  6.157721 -1.461937 0.389599
C  6.07108 0.783146 -0.633601
C  6.79599 -0.318969 -0.135426
H  -4.094502 2.294902 -0.417506
H  -4.110537 1.452224 -1.965066
H  -2.259045 1.314167 1.35414
H  -2.013101 0.908133 -2.958447
H  0.483037 0.587592 -2.763473
H  0.694013 -0.014998 2.260329
H  1.331157 1.612077 1.922288
H  -0.266788 1.425932 2.706603
H  -3.159152 -1.31492 -0.502417
H  -7.826986 -0.331503 1.025074
H  -4.570083 -3.157283 0.428172
H  -6.919536 -2.672946 1.20873
H  4.218638 -2.365578 0.81361
H  4.075276 1.57714 -0.984981
H  6.747358 -2.301152 0.768533
H  6.595947 1.654887 -1.033951
