program: Gaussian 09
title: 000223490
version: EM64L-G09RevD.01
frameworkgroup: C1[X(C14H13BrO)]
method: RPBEPBE
basis: SDD
operation: Freq
keyword: #p
keyword: freq=noraman
keyword: PBEPBE/SDD
title: #p freq=noraman PBEPBE/SDD
converged: YES YES NO NO
title: Mulliken charges:
elementType: Br O C C C C C C C C C C C C C C H H H H H H H H H H H H H
charge: -0.006461 -0.438830 -0.647050 0.321095 0.558467 -0.026636 0.325911 -0.334587 -0.408438 -0.260783 -0.394381 -0.401055 -0.864105 -0.196895 -0.235355 -0.237161 0.268891 0.237042 0.244345 0.229035 0.223700 0.244948 0.234974 0.229669 0.249176 0.248774 0.231084 0.234257 0.370369
chargesum: 0.00000
title: Mulliken charges with hydrogens summed into heavy atoms:
elementType: Br O C C C C C C C C C C C C C C
charge: -0.006461 -0.068461 -0.141117 0.321095 0.558467 -0.026636 0.325911 -0.090242 -0.179403 -0.037083 -0.394381 -0.156107 -0.150286 0.051879 -0.004271 -0.002904
polarizability: 2.09276152e+02 -3.17478401e+01 1.54670172e+02 -7.09193130e+00 2.23267046e+00 1.29379829e+02
1716.lowfreq: -7.7502 -0.0005 0.0003 0.0005 4.0540 9.1144 13.0744 27.9458 63.1464
frequency: 9.8282 27.7873 63.1452 104.3219 130.0089 158.3214 181.0017 190.1354 237.1869 249.3041 274.7003 296.8372 300.7885 309.2502 387.2729 437.4511 461.4002 484.1554 499.8862 522.3166 541.1062 554.8741 596.8484 647.4459 677.9909 721.8405 743.0980 763.6749 772.3634 804.1667 825.3641 872.7195 896.1881 906.8970 933.4221 950.8307 971.0526 986.1511 997.2920 1005.1575 1041.8748 1041.9578 1087.1182 1116.7766 1156.8929 1170.5099 1176.1825 1185.1151 1195.4661 1214.4031 1262.0424 1274.2033 1288.3296 1320.4634 1369.1850 1391.1869 1398.4062 1420.9208 1442.3997 1455.7160 1460.5115 1469.6522 1478.5769 1490.4606 1570.3697 1600.3175 1604.3040 1621.6095 2951.0622 2985.4365 3018.2700 3043.6913 3087.7401 3122.7817 3125.7020 3137.9395 3140.5100 3157.7921 3160.4705 3173.0683 3584.0143
redmass: 5.1370 7.2299 4.6936 5.0073 4.4355 1.1087 4.9820 3.1710 3.3239 5.2210 3.9217 2.4408 5.7726 1.3668 2.5990 3.4057 4.5040 4.0346 3.5220 4.9053 3.5871 5.2184 4.9106 6.6048 4.6036 4.4684 2.4736 1.5209 1.2858 4.6922 3.7760 1.4793 1.4514 2.5172 1.6998 1.3980 1.3578 1.3295 1.7983 6.8372 1.6406 1.9150 1.8894 1.6724 1.4725 1.0937 1.4304 1.3042 2.0061 2.0303 1.5690 1.9872 1.7003 1.5167 7.5084 2.4625 1.7655 2.1246 2.2723 1.6045 2.4064 1.4336 1.0488 1.4117 5.9935 6.9628 5.9875 7.1793 1.0402 1.0642 1.0977 1.0949 1.0941 1.0871 1.0872 1.0906 1.0893 1.0948 1.0989 1.0997 1.0654
irintensity: 0.6750 0.2606 0.6363 0.5192 0.1747 0.0971 1.5780 1.7674 3.2069 2.2246 4.7492 24.4391 6.9107 87.1026 1.2802 4.5637 11.3882 0.6946 1.1381 2.8753 0.2323 9.4513 3.8002 17.4543 0.4875 1.9990 17.8772 78.9824 45.1001 7.3496 9.9230 2.5126 1.7753 20.3668 5.3859 2.2438 0.7060 0.0925 4.9437 57.2165 3.0295 7.3443 29.0228 0.5816 152.0026 3.3353 18.5524 2.0167 8.2197 6.4301 14.5497 2.0610 2.9502 5.8892 2.1884 2.2041 29.7293 20.3995 38.8540 0.7299 35.6494 26.8910 15.7250 24.0895 11.9255 2.8870 12.2207 0.6813 41.3706 16.3026 23.5066 3.8700 13.8931 6.3661 5.7764 16.7774 8.7200 18.2748 21.3288 17.6932 29.7931
temp: 298.150 k
press: 1.00000 atm
elementType: 35 8 6 6 6 6 6 6 6 6 6 6 6 6 6 6 1 1 1 1 1 1 1 1 1 1 1 1 1
symmnumber: 1
zpe: 595064.5 jmol-1
zpe.correction: 0.226648 hartree
zpe.thermalcorrener: 0.241595 hartree
zpe.thermalcorrenthalpy: 0.242539 hartree
zpe.thermalcorrgfe: 0.181985 hartree
zpe.sumelectzpe: -628.839946 hartree
zpe.sumelectthermal: -628.824999 hartree
zpe.sumelectthermalent: -628.824055 hartree
zpe.sumelectthermalfe: -628.884609 hartree
dipole: -1.3930 -1.1410 0.1331
dipole: 1.8055
quadrupole: -80.3244 -100.9516 -102.6345
quadrupole: -9.0192 -4.4066 0.6779
quadrupole: 14.3124 -6.3147 -7.9977 -9.0192 -4.4066 0.6779
hfenergy: -629.0665937 hartree
pointgroup: C01 [X(C14H13Br1O1)]
dipole: -0.5223096 0.3860563 -0.287652 debye
polarizability: 210.5095798|31.7926736|151.1141412|-0.8367689|-5.7738788|131.7024325 unknown
InChI: InChI=1S/C14H13BrO/c1-10-5-4-7-12(14(10)16)9-11-6-2-3-8-13(11)15/h2-8,16H,9H2,1H3
charge 0 multiplicity 1
29 atoms
Br 1.380586 -2.113826 1.623738
O  -2.157056 -1.668267 -1.330018
C  0.345595 -0.498663 -1.028659
C  -0.863937 0.063336 -0.279216
C  1.693088 -0.069449 -0.478005
C  -2.128761 -0.554227 -0.459886
C  -3.305873 -0.087795 0.185856
C  -0.795845 1.190716 0.570056
C  -3.192401 1.042107 1.030554
C  -1.948766 1.681792 1.22305
C  2.294551 -0.654847 0.665626
C  2.422335 0.972114 -1.114065
C  -4.635623 -0.788796 -0.036257
C  3.548607 -0.24091 1.161431
C  3.677883 1.407452 -0.638556
C  4.244064 0.799101 0.503969
H  0.261812 -1.600767 -1.033645
H  0.27572 -0.190041 -2.090481
H  0.171414 1.679354 0.729145
H  -4.088737 1.417678 1.538568
H  -1.875995 2.554082 1.881059
H  1.982222 1.44264 -2.001385
H  -4.952997 -0.760067 -1.098516
H  -4.61036 -1.851722 0.281806
H  -5.432276 -0.302328 0.550248
H  3.976556 -0.724682 2.044264
H  4.210265 2.212322 -1.156403
H  5.218709 1.12234 0.884814
H  -3.054181 -2.084545 -1.336593
