program: Gaussian 09
title: 000223488
version: EM64L-G09RevD.01
frameworkgroup: C1[X(C14H13BrO)]
method: RPBEPBE
basis: SDD
operation: Freq
keyword: #p
keyword: freq=noraman
keyword: PBEPBE/SDD
title: #p freq=noraman PBEPBE/SDD
converged: NO YES NO NO
title: Mulliken charges:
elementType: Br O C C C C C C C C C C C C C C H H H H H H H H H H H H H
charge: -0.004321 -0.296457 -0.387678 0.384027 0.378133 0.440545 -0.337140 -0.384167 -0.326096 -0.405797 -0.424900 -0.329192 -0.187527 -0.203445 -0.808244 -0.207441 0.226839 0.226403 0.246049 0.246100 0.247080 0.279309 0.228403 0.230762 0.234266 0.229407 0.223342 0.229489 0.252254
chargesum: 0.00000
title: Mulliken charges with hydrogens summed into heavy atoms:
elementType: Br O C C C C C C C C C C C C C C
charge: -0.004321 -0.296457 0.065564 0.384027 0.378133 0.440545 -0.091092 -0.138068 -0.079016 -0.126489 -0.196497 -0.098430 -0.187527 0.030821 -0.126006 0.044813
polarizability: 2.71285857e+02 -6.52259709e+00 1.69629243e+02 -1.60768393e-02 -1.00215363e-01 7.20597300e+01
1716.lowfreq: -5.4082 0.0001 0.0003 0.0005 2.8259 6.0687 17.7524 30.2129 43.6949
frequency: 15.1493 29.7237 43.6943 51.4938 93.1159 148.6813 148.8997 159.7968 175.1922 216.8180 280.4240 308.3895 330.6541 354.6667 413.6030 427.4426 471.5715 483.5444 506.8562 513.4668 602.7652 635.1067 655.2384 685.7846 709.9694 747.6975 787.8403 808.6693 821.7049 827.9260 838.6620 876.5584 920.6564 930.9098 963.2708 981.5545 984.0491 990.9812 1004.0907 1007.3170 1021.9333 1047.4823 1067.4815 1093.6394 1122.1644 1177.2235 1181.0043 1209.1694 1212.0450 1219.3393 1226.9623 1291.9701 1306.8770 1339.5679 1374.6905 1384.1955 1400.2430 1415.3655 1417.8258 1462.7927 1470.2905 1470.5710 1477.3448 1504.8638 1574.5705 1587.6080 1610.3107 1627.8887 2935.9817 2972.9958 2987.0446 3049.8230 3079.9207 3122.5655 3125.0012 3140.8327 3142.9306 3158.4208 3162.4521 3170.8702 3188.0709
redmass: 3.8834 4.7703 1.0666 6.1074 3.7341 3.6465 8.1275 4.6977 5.9464 2.8966 5.0623 5.0503 4.3177 3.6933 2.9240 2.8800 4.6411 6.3776 2.5132 3.9459 5.5034 6.8473 7.1513 2.6109 3.0222 5.2184 1.3075 1.4084 6.1861 1.3587 4.8047 1.3433 1.3309 1.3227 1.3488 3.7508 1.8438 1.3478 5.4478 2.6600 1.7103 1.5296 2.1896 1.5669 1.2586 1.0823 1.2681 1.9859 1.0696 2.2852 6.0224 1.3461 1.2921 1.8015 5.1091 4.1618 1.2534 3.1855 2.5736 1.7896 1.0456 1.3583 1.1040 2.4929 6.4851 6.4975 6.5468 6.4332 1.0550 1.0373 1.1052 1.0977 1.0985 1.0893 1.0890 1.0921 1.0883 1.0942 1.0955 1.0949 1.0956
irintensity: 1.0111 0.7728 0.4069 0.1528 2.0881 2.1527 0.2376 2.1333 1.0254 4.5894 1.6996 4.6907 3.9118 0.5639 0.2836 7.0440 0.2753 1.2569 20.7270 0.4855 4.1288 0.9966 23.9602 20.6124 0.1391 26.8307 48.1929 57.6009 36.5921 31.2194 13.7584 11.7937 0.0867 1.3424 0.4161 1.0872 11.1729 0.3178 25.9413 24.0238 2.3219 11.3039 19.8056 18.5813 16.6597 8.4048 58.4656 6.8448 0.4170 175.9752 170.2534 5.8070 2.7900 23.4815 7.0606 7.4907 11.0246 3.3106 37.1056 87.8798 12.5746 13.2152 11.6022 150.2314 48.4149 21.0196 32.9559 34.7622 24.5149 48.9834 27.2434 23.4409 19.3859 15.6653 28.6680 6.6523 5.2642 19.2986 3.3665 5.7453 4.2490
temp: 298.150 k
press: 1.00000 atm
elementType: 35 8 6 6 6 6 6 6 6 6 6 6 6 6 6 6 1 1 1 1 1 1 1 1 1 1 1 1 1
symmnumber: 1
zpe: 595060.0 jmol-1
zpe.correction: 0.226646 hartree
zpe.thermalcorrener: 0.241699 hartree
zpe.thermalcorrenthalpy: 0.242644 hartree
zpe.thermalcorrgfe: 0.180669 hartree
zpe.sumelectzpe: -628.826048 hartree
zpe.sumelectthermal: -628.810994 hartree
zpe.sumelectthermalent: -628.810050 hartree
zpe.sumelectthermalfe: -628.872025 hartree
dipole: -2.2500 -0.1683 0.0167
dipole: 2.2563
quadrupole: -98.8467 -91.9893 -109.8835
quadrupole: 5.5768 0.0144 -0.0143
quadrupole: 1.3931 8.2505 -9.6436 5.5768 0.0144 -0.0143
hfenergy: -629.0526939 hartree
pointgroup: C01 [X(C14H13Br1O1)]
dipole: -0.8854564 -0.0195884 0.0600804 debye
polarizability: 267.2293318|6.3654032|94.0197554|-20.1313766|-41.739055|151.7257421 unknown
InChI: InChI=1S/C14H13BrO/c1-11-5-7-14(8-6-11)16-10-12-3-2-4-13(15)9-12/h2-9H,10H2,1H3
charge 0 multiplicity 1
29 atoms
Br 5.777686 0.718379 -1.93573
O  -0.378091 -0.352111 0.348951
C  0.523592 0.167758 -0.680396
C  1.958678 -0.093233 -0.253232
C  -1.762039 -0.208301 0.129343
C  -4.600124 -0.027498 -0.10359
C  -2.339494 0.39556 -1.011873
C  -2.59387 -0.7222 1.154786
C  3.002668 0.342365 -1.109305
C  2.276062 -0.751737 0.956563
C  -3.749564 0.477913 -1.113291
C  -3.991139 -0.629399 1.033373
C  4.339746 0.110225 -0.738375
C  3.627387 -0.972671 1.307774
C  -6.112052 0.062869 -0.217479
C  4.677249 -0.54422 0.464116
H  0.352724 1.257521 -0.812131
H  0.313608 -0.333043 -1.649624
H  -1.722239 0.800846 -1.819162
H  -2.125585 -1.185011 2.029241
H  2.77465 0.85453 -2.050805
H  1.463964 -1.083472 1.607442
H  -4.188563 0.947318 -2.001981
H  -4.62481 -1.030538 1.834031
H  3.871571 -1.482871 2.245771
H  -6.547387 0.63753 0.622082
H  -6.41767 0.558215 -1.155448
H  -6.579526 -0.940052 -0.200865
H  5.722969 -0.714672 0.735109
