program: Gaussian 09
title: 000223486
version: EM64L-G09RevD.01
frameworkgroup: C1[X(C14H11ClO2)]
method: RPBEPBE
basis: SDD
operation: Freq
keyword: #p
keyword: freq=noraman
keyword: PBEPBE/SDD
title: #p freq=noraman PBEPBE/SDD
converged: YES YES NO NO
title: Mulliken charges:
elementType: Cl O O C C C C C C C C C C C C C C H H H H H H H H H H H
charge: -0.047571 -0.412198 -0.233750 0.310039 0.315048 -0.531226 0.005304 0.309512 -0.350957 0.128396 -0.353566 -0.852977 -0.364978 -0.352546 -0.219936 -0.214630 -0.108371 0.276759 0.269254 0.256618 0.260702 0.234312 0.235142 0.274005 0.276717 0.259131 0.259789 0.371981
chargesum: 0.00000
title: Mulliken charges with hydrogens summed into heavy atoms:
elementType: Cl O O C C C C C C C C C C C C C C
charge: -0.047571 -0.040217 -0.233750 0.310039 0.315048 -0.254468 0.005304 0.309512 -0.081703 0.128396 -0.096948 -0.122821 -0.090973 -0.075829 0.039194 0.045159 -0.108371
polarizability: 2.92169198e+02 -6.64908347e-01 1.58587927e+02 1.04739214e+01 -3.96420242e+00 8.70167555e+01
1716.lowfreq: -12.5791 -6.5182 -1.9676 -0.0021 -0.0009 0.0009 30.6521 46.3042 63.0178
frequency: 30.5638 46.2963 63.0137 94.7273 132.1399 144.5586 175.1542 189.3226 205.7092 251.6801 289.2654 292.0080 324.2479 346.2529 355.5660 404.8208 413.5880 443.3405 461.6909 487.0313 533.7539 539.5941 577.7557 621.4997 630.7884 679.8749 711.8224 727.5107 742.7291 763.6193 830.4163 837.7729 839.3998 853.5430 926.8776 956.9789 962.3087 972.6103 979.9755 992.6258 1005.1017 1045.6627 1071.2691 1107.7519 1108.7856 1134.5505 1151.4050 1183.1619 1196.7144 1253.5784 1290.4084 1296.3415 1305.8074 1367.6244 1388.7652 1393.3695 1401.9934 1419.2652 1471.2908 1471.8425 1478.1586 1495.8570 1528.2665 1577.8891 1584.1578 1592.9381 1628.3515 2956.6170 3025.7001 3094.2212 3144.0722 3147.5352 3152.1876 3155.1598 3172.4438 3174.4885 3176.8237 3573.5131
redmass: 4.9637 6.5159 4.6669 8.8551 2.2358 1.5643 6.3818 2.8862 6.7981 7.2667 5.3225 4.0081 6.1557 7.8445 1.1600 4.3046 3.2948 2.8212 4.7915 4.2063 4.6490 4.6779 4.4775 7.0273 7.1087 4.1421 6.3267 3.8858 5.0736 3.0626 1.5267 2.6152 1.3987 2.0043 1.4536 1.6438 1.8857 1.3443 1.3575 2.4796 2.9003 1.5182 2.7983 1.5666 1.4596 2.2996 1.3165 1.1278 2.8789 2.1595 1.3415 1.3594 3.8645 5.4789 2.4488 3.9234 1.6443 3.2604 2.1155 1.6190 1.0491 2.1616 10.9520 7.3902 6.3229 6.3288 6.8028 1.0403 1.0981 1.0944 1.0917 1.0891 1.0884 1.0888 1.0963 1.0965 1.0975 1.0654
irintensity: 1.1723 0.3805 0.1049 4.8081 0.2064 0.0463 3.4882 2.7514 1.0104 3.6636 0.9147 3.5765 2.8718 2.5250 124.5058 1.0392 1.2385 17.0419 31.3383 29.5804 6.0272 0.3540 6.9940 0.8786 15.7475 11.8665 5.9009 0.8556 23.8578 56.4466 31.6927 26.6658 9.1098 39.0276 14.8275 19.8867 17.0118 5.5037 3.7125 17.1126 23.9713 7.5525 57.1851 9.6841 9.1862 130.0136 233.2012 19.1080 62.5522 69.4453 40.3543 43.8866 268.4985 13.1243 23.9344 19.8498 35.7794 17.9369 28.5414 27.2077 16.0801 38.0758 141.4311 11.9686 81.8101 133.3878 61.5958 37.0256 20.8914 8.0985 4.8053 8.7338 0.0190 0.1049 3.3184 6.1310 2.3676 69.4384
temp: 298.150 k
press: 1.00000 atm
elementType: 17 8 8 6 6 6 6 6 6 6 6 6 6 6 6 6 6 1 1 1 1 1 1 1 1 1 1 1
symmnumber: 1
zpe: 547623.5 jmol-1
zpe.correction: 0.208579 hartree
zpe.thermalcorrener: 0.223806 hartree
zpe.thermalcorrenthalpy: 0.224751 hartree
zpe.thermalcorrgfe: 0.165075 hartree
zpe.sumelectzpe: -1149.413499 hartree
zpe.sumelectthermal: -1149.398271 hartree
zpe.sumelectthermalent: -1149.397327 hartree
zpe.sumelectthermalfe: -1149.457002 hartree
dipole: 3.5566 -1.3843 0.7486
dipole: 3.8892
quadrupole: -88.2555 -112.0399 -105.7813
quadrupole: 1.3911 7.6698 -1.9453
quadrupole: 13.7701 -10.0144 -3.7557 1.3911 7.6698 -1.9453
hfenergy: -1149.6220775 hartree
pointgroup: C01 [X(C14H11Cl1O2)]
dipole: -1.4145738 -0.5831907 0.0131959 debye
polarizability: 286.1888924|14.9044609|120.308953|31.3874997|-33.9871063|131.2760353 unknown
InChI: InChI=1S/C14H11ClO2/c1-9-8-11(4-7-13(9)16)14(17)10-2-5-12(15)6-3-10/h2-8,16H,1H3
charge 0 multiplicity 1
28 atoms
Cl 5.785889 -0.860048 1.462352
O  -4.725641 -1.159662 0.884442
O  0.383407 1.600892 -1.86161
C  -0.947231 0.218678 -0.411496
C  -3.328142 -0.22325 -0.931785
C  -2.050887 0.231479 -1.308236
C  0.355572 0.769688 -0.895636
C  1.651681 0.346853 -0.255432
C  -1.154033 -0.242101 0.91889
C  -3.494994 -0.688425 0.408434
C  -2.422612 -0.687825 1.328542
C  -4.499782 -0.222739 -1.897641
C  1.854362 -0.948647 0.291573
C  2.741467 1.257825 -0.288219
C  3.113202 -1.325348 0.808515
C  3.998499 0.904478 0.239829
C  4.162695 -0.386621 0.783497
H  -1.880575 0.617654 -2.319461
H  -0.336084 -0.214446 1.645441
H  -2.607256 -1.03015 2.35075
H  -4.192071 0.171697 -2.879288
H  -4.900743 -1.242019 -2.07093
H  -5.333718 0.41615 -1.54247
H  1.041487 -1.681438 0.284093
H  2.586186 2.24145 -0.742726
H  3.275328 -2.327437 1.215295
H  4.83342 1.61059 0.226669
H  -5.423025 -1.112678 0.18351
