program: Gaussian 09
title: 000223482
version: EM64L-G09RevD.01
frameworkgroup: C1[X(C14H11ClO2)]
method: RPBEPBE
basis: SDD
operation: Freq
keyword: #p
keyword: freq=noraman
keyword: PBEPBE/SDD
title: #p freq=noraman PBEPBE/SDD
converged: YES YES NO NO
title: Mulliken charges:
elementType: Cl O O C C C C C C C C C C C C C C H H H H H H H H H H H
charge: -0.071505 -0.425623 -0.219464 0.181140 0.443646 -0.501694 0.015484 0.371534 0.162033 -0.366327 -0.379673 -0.807701 -0.297336 -0.372691 -0.106127 -0.215408 -0.234105 0.271087 0.236090 0.220685 0.271441 0.275331 0.239457 0.231427 0.222097 0.236556 0.258406 0.361243
chargesum: 0.00000
title: Mulliken charges with hydrogens summed into heavy atoms:
elementType: Cl O O C C C C C C C C C C C C C C
charge: -0.071505 -0.064381 -0.219464 0.181140 0.443646 -0.230607 0.015484 0.371534 0.162033 -0.130237 -0.158989 -0.114721 -0.025895 -0.097361 -0.106127 0.021148 0.024300
polarizability: 2.33815258e+02 8.80248408e+00 1.72742449e+02 1.61010648e+01 -5.56772056e+00 1.03486058e+02
1716.lowfreq: -40.7865 -11.1243 -7.4345 -0.0012 -0.0007 0.0009 5.1842 30.3847 38.3968
frequency: -40.4565 30.3492 38.3077 61.5316 114.1632 128.1633 161.9466 185.0723 192.9480 235.6013 286.1067 310.4630 335.1213 346.2084 353.2871 377.8196 411.7785 435.7217 442.9326 461.0391 505.0216 521.6410 596.1488 637.5827 663.4500 669.5943 702.7752 727.6236 749.0083 774.4223 802.0064 812.9284 853.1777 903.2143 908.5362 928.1764 946.8145 965.8337 985.5250 990.7712 1010.3261 1048.7906 1071.3850 1079.1122 1097.3361 1148.6777 1164.5722 1174.7243 1215.5069 1244.1797 1264.4677 1290.7301 1300.0925 1380.9553 1385.1600 1399.2593 1402.6511 1410.0759 1460.7417 1472.9801 1474.5740 1494.8897 1535.2634 1575.0298 1594.5966 1603.0780 1619.3581 2976.8589 3058.2080 3086.3249 3111.7531 3139.8821 3143.6150 3144.2681 3165.3355 3172.0268 3176.9555 3578.4613
redmass: 1.0162 5.8701 6.0216 6.2122 6.0997 7.2670 4.7826 4.9944 4.9197 5.3743 4.9001 5.6607 2.8069 1.2985 5.2251 7.0640 3.9197 3.6752 4.3909 5.8977 4.5154 3.4574 4.7065 7.2484 6.6525 3.5596 3.0391 5.2120 4.2155 3.1254 1.4381 1.8636 5.9113 1.4160 1.4422 1.4314 1.4054 2.3887 5.3980 1.3685 1.8501 1.5405 2.2075 2.1201 1.5864 1.8201 1.1917 1.0857 2.6214 3.2040 2.0882 1.3856 1.6962 9.2402 7.0494 1.7489 1.8860 2.8980 2.4026 1.0810 1.1489 2.5347 10.3907 6.9966 6.2807 6.8571 6.6384 1.0387 1.0954 1.0998 1.0880 1.0935 1.0944 1.0873 1.0927 1.0928 1.0987 1.0661
irintensity: 0.7704 1.1862 3.8085 0.9972 1.0237 0.3727 4.3430 2.0929 0.3720 0.9673 1.8110 5.6089 5.4361 96.0643 8.2737 3.0487 5.9735 2.8924 8.9265 2.8833 12.0556 20.8189 3.4029 12.8392 18.1901 5.5231 21.1368 48.0656 32.5422 11.7016 47.6659 30.1441 18.0096 4.8208 6.3594 1.4821 0.9910 37.9468 3.3901 2.6758 2.3199 13.9375 26.5370 76.9812 16.4302 63.7557 16.8672 10.1357 88.3215 28.1579 105.8930 7.3563 157.8724 2.2582 17.0733 32.0319 90.4673 18.4542 15.6714 19.8922 20.4198 47.8940 187.7186 6.5292 34.1903 9.9041 29.8243 38.6635 20.3179 16.3726 12.9329 11.8682 12.1733 6.4249 1.4024 2.7411 10.3711 40.5255
temp: 298.150 k
press: 1.00000 atm
elementType: 17 8 8 6 6 6 6 6 6 6 6 6 6 6 6 6 6 1 1 1 1 1 1 1 1 1 1 1
symmnumber: 1
zpe: 545646.8 jmol-1
zpe.correction: 0.207826 hartree
zpe.thermalcorrener: 0.222520 hartree
zpe.thermalcorrenthalpy: 0.223464 hartree
zpe.thermalcorrgfe: 0.164856 hartree
zpe.sumelectzpe: -1149.406269 hartree
zpe.sumelectthermal: -1149.391575 hartree
zpe.sumelectthermalent: -1149.390631 hartree
zpe.sumelectthermalfe: -1149.449239 hartree
dipole: -1.5504 -2.5785 1.3766
dipole: 3.3087
quadrupole: -88.8277 -108.1509 -101.7588
quadrupole: 13.7673 3.6199 -6.2110
quadrupole: 10.7515 -8.5718 -2.1797 13.7673 3.6199 -6.2110
hfenergy: -1149.614095 hartree
pointgroup: C01 [X(C14H11Cl1O2)]
dipole: 0.8283392 0.2960283 0.9595348 debye
polarizability: 229.9334845|20.6242824|130.3866799|-20.9764359|31.1155413|149.7236008 unknown
InChI: InChI=1S/C14H11ClO2/c1-9-5-6-13(16)12(7-9)14(17)10-3-2-4-11(15)8-10/h2-8,16H,1H3
charge 0 multiplicity 1
28 atoms
Cl -3.312613 2.526327 1.742107
O  0.435588 -0.626117 1.904673
O  -0.065243 -1.550185 -2.000038
C  1.112922 -0.224354 -0.388947
C  3.358958 0.717944 -0.885627
C  2.119698 0.184195 -1.303502
C  -0.146048 -0.810459 -0.96957
C  -1.497938 -0.476832 -0.403213
C  1.392988 -0.131827 1.003424
C  3.591639 0.826042 0.510546
C  2.628975 0.396421 1.446045
C  4.415908 1.13552 -1.893171
C  -1.719448 0.704414 0.350871
C  -2.588915 -1.332915 -0.707027
C  -3.02282 0.996673 0.782882
C  -3.884573 -1.023065 -0.248584
C  -4.116636 0.153808 0.503553
H  1.902957 0.067905 -2.371504
H  4.540565 1.240645 0.870972
H  2.840474 0.465476 2.521311
H  -0.892269 1.380457 0.582235
H  -2.396992 -2.22752 -1.307337
H  5.067505 0.28228 -2.164407
H  3.959851 1.507419 -2.827159
H  5.06723 1.93174 -1.491722
H  -4.723853 -1.688997 -0.474455
H  -5.119265 0.408872 0.859089
H  0.748255 -0.534765 2.838855
