program: Gaussian 09
title: 000223481
version: EM64L-G09RevD.01
frameworkgroup: C1[X(C14H11ClO2)]
method: RPBEPBE
basis: SDD
operation: Freq
keyword: #p
keyword: freq=noraman
keyword: PBEPBE/SDD
title: #p freq=noraman PBEPBE/SDD
converged: YES YES NO NO
title: Mulliken charges:
elementType: Cl O O C C C C C C C C C C C C C C H H H H H H H H H H H
charge: -0.038855 -0.429132 -0.214098 0.355270 0.319394 -0.440970 -0.014654 0.395930 -0.355503 0.130206 -0.390062 -0.818053 -0.310300 -0.351631 -0.227531 -0.236593 -0.220340 0.256917 0.275851 0.222346 0.266878 0.233945 0.229912 0.264249 0.258945 0.237299 0.237471 0.363111
chargesum: 0.00000
title: Mulliken charges with hydrogens summed into heavy atoms:
elementType: Cl O O C C C C C C C C C C C C C C
charge: -0.038855 -0.066021 -0.214098 0.355270 0.319394 -0.184053 -0.014654 0.395930 -0.079652 0.130206 -0.167716 -0.087318 -0.310300 -0.087382 0.031414 0.000706 0.017131
polarizability: 2.38347537e+02 8.98297931e-01 1.57983278e+02 2.54654575e+01 2.59612843e+00 1.15528149e+02
1716.lowfreq: -97.6103 -2.1578 0.0012 0.0014 0.0017 5.0402 13.7768 30.9810 40.3541
frequency: -97.6049 30.7550 39.9342 62.1600 99.0540 127.9443 136.6644 197.5280 208.0130 252.4082 283.5733 299.7628 314.2318 371.1083 388.9474 400.6779 408.6254 440.1878 442.6602 469.0425 540.0542 545.1524 580.0781 616.9924 650.4125 686.2767 711.0422 732.6088 749.0821 754.1641 778.3301 823.7249 861.2596 872.7129 924.3871 948.9872 957.4338 966.2010 989.6742 1005.9284 1019.0291 1043.1181 1049.9722 1084.9722 1122.5454 1149.0460 1161.0884 1173.2475 1208.9006 1247.8615 1259.1164 1287.0904 1313.1952 1366.5984 1396.1427 1398.3032 1412.6402 1418.4017 1453.7121 1472.5523 1482.9849 1496.5612 1538.8352 1568.9607 1599.2565 1605.3042 1613.1807 2986.9910 3061.6496 3114.4791 3118.5474 3136.0361 3138.8436 3150.8373 3164.2538 3164.4530 3175.8703 3581.5190
redmass: 1.0197 8.3531 4.4462 5.3653 7.8410 5.7219 6.9427 3.9090 5.3430 6.4889 5.7518 3.5762 5.1850 6.9038 1.1652 7.1967 4.9910 3.0296 3.9756 4.1106 4.3714 4.5818 4.2820 6.8548 6.7487 4.4288 5.3803 3.7485 4.7158 1.8305 2.0966 1.5999 5.0595 1.4989 1.3884 2.1805 1.7940 1.3942 1.3421 1.7170 5.9293 2.1345 1.5122 1.9133 1.7541 2.0286 1.1498 1.0593 2.1230 2.1991 1.8281 1.8376 2.1588 8.6414 1.6805 2.5574 4.1053 2.2512 2.4474 1.1348 1.0469 3.0407 10.1733 6.2450 6.7880 6.5217 6.6131 1.0389 1.0978 1.0899 1.0969 1.0912 1.0857 1.0904 1.0952 1.0949 1.1005 1.0660
irintensity: 0.0397 3.1061 1.1640 0.7879 2.3187 0.2110 0.9787 3.5803 2.2263 0.3275 4.4770 12.8827 5.2185 1.1289 133.7134 2.9847 7.9388 1.5319 1.3236 15.3954 3.5267 13.5884 0.4994 36.8902 6.2812 19.8149 3.4415 5.8121 7.3184 73.9680 30.8730 35.6373 4.9672 0.5089 7.3184 38.6214 21.8802 6.6725 1.3297 2.9577 40.9070 2.4781 7.0175 265.9364 1.9448 3.9244 18.3955 0.8957 10.3369 18.2393 74.5958 299.4352 140.8420 3.4582 28.2982 15.3292 2.3465 42.9130 11.9755 12.7643 16.3652 5.4710 232.5440 26.9254 50.8921 4.1057 101.4523 23.0341 17.2394 17.9253 6.9560 5.7722 1.4265 5.9760 10.7785 3.5088 17.1599 63.6460
temp: 298.150 k
press: 1.00000 atm
elementType: 17 8 8 6 6 6 6 6 6 6 6 6 6 6 6 6 6 1 1 1 1 1 1 1 1 1 1 1
symmnumber: 1
zpe: 546716.6 jmol-1
zpe.correction: 0.208233 hartree
zpe.thermalcorrener: 0.222850 hartree
zpe.thermalcorrenthalpy: 0.223795 hartree
zpe.thermalcorrgfe: 0.165387 hartree
zpe.sumelectzpe: -1149.406957 hartree
zpe.sumelectthermal: -1149.392340 hartree
zpe.sumelectthermalent: -1149.391395 hartree
zpe.sumelectthermalfe: -1149.449803 hartree
dipole: 1.1932 -1.8821 -1.5902
dipole: 2.7377
quadrupole: -78.6564 -109.7367 -105.5528
quadrupole: 12.6088 10.0055 -0.2836
quadrupole: 19.3256 -11.7547 -7.5709 12.6088 10.0055 -0.2836
hfenergy: -1149.6151901 hartree
pointgroup: C01 [X(C14H11Cl1O2)]
dipole: 0.5104062 0.9229964 -0.2184062 debye
polarizability: 232.1291302|-27.9533194|137.9839276|-24.4160181|-18.1194804|141.7459057 unknown
InChI: InChI=1S/C14H11ClO2/c1-9-8-10(6-7-13(9)16)14(17)11-4-2-3-5-12(11)15/h2-8,16H,1H3
charge 0 multiplicity 1
28 atoms
Cl -1.22807 -0.682483 -2.100365
O  4.805065 0.293853 -0.730198
O  -0.672336 -1.863661 1.901281
C  0.883266 -0.608066 0.556611
C  2.493635 0.940301 -0.519827
C  1.189383 0.619833 -0.088616
C  -0.480229 -0.931565 1.058657
C  -1.672209 -0.094733 0.632147
C  1.927968 -1.545716 0.78134
C  3.511642 -0.027105 -0.290269
C  3.232767 -1.260897 0.35572
C  2.799725 2.258131 -1.206204
C  -2.103697 0.107578 -0.699849
C  -2.469532 0.46662 1.667707
C  -3.254708 0.858751 -1.012147
C  -3.615468 1.234393 1.379453
C  -4.00608 1.436609 0.035148
H  0.392925 1.355273 -0.250809
H  1.688323 -2.484536 1.290129
H  4.038543 -1.988538 0.519597
H  3.867499 2.33728 -1.459324
H  2.215688 2.359336 -2.139675
H  2.534032 3.113613 -0.557951
H  -2.169311 0.278138 2.703696
H  -3.561956 0.97623 -2.055336
H  -4.204428 1.664804 2.195753
H  -4.89823 2.025619 -0.202475
H  5.439891 -0.437261 -0.526394
