program: Gaussian 09
title: 000223479
version: EM64L-G09RevD.01
frameworkgroup: C1[X(C14H11ClO2)]
method: RPBEPBE
basis: SDD
operation: Freq
keyword: #p
keyword: freq=noraman
keyword: PBEPBE/SDD
title: #p freq=noraman PBEPBE/SDD
converged: YES YES NO NO
title: Mulliken charges:
elementType: Cl O O C C C C C C C C C C C C C C H H H H H H H H H H H
charge: -0.029199 -0.395623 -0.306902 0.159040 0.022214 0.323997 0.093747 0.414229 -0.320633 -0.385110 -0.260333 -0.776863 -0.322835 -0.351468 -0.222153 -0.233774 -0.217875 0.253851 0.238124 0.231109 0.244577 0.245125 0.211034 0.260404 0.261061 0.239427 0.239612 0.385215
chargesum: 0.00000
title: Mulliken charges with hydrogens summed into heavy atoms:
elementType: Cl O O C C C C C C C C C C C C C C
charge: -0.029199 -0.010407 -0.306902 0.159040 0.022214 0.323997 0.093747 0.414229 -0.066783 -0.146986 -0.029223 -0.076126 -0.322835 -0.091064 0.038908 0.005653 0.021737
polarizability: 2.43188692e+02 -9.56030006e+00 1.55962026e+02 1.58411324e+01 5.65750013e+00 1.12223501e+02
1716.lowfreq: -3.8139 -0.0021 -0.0017 -0.0010 5.0460 6.8384 30.9335 41.9079 72.7017
frequency: 30.9271 41.8270 72.7006 113.9662 124.5321 136.6956 150.3926 205.0324 220.6896 247.1766 271.3234 292.0565 333.9106 391.7354 411.1510 427.7096 466.2113 471.2066 481.8389 530.8200 547.2117 568.7869 620.5949 647.8077 680.8121 703.6458 738.8454 758.3081 771.6982 795.3910 806.2917 840.4930 872.2116 924.0612 942.9223 953.8400 967.3618 976.7915 990.6254 1014.3973 1026.7403 1050.0437 1059.4320 1089.5345 1123.8721 1174.2621 1176.7447 1186.3633 1236.5471 1259.8408 1271.9146 1315.2950 1354.7360 1365.1809 1394.5087 1402.9002 1419.6788 1426.0289 1443.7714 1454.7781 1461.3477 1480.1517 1531.8472 1569.2499 1597.6354 1601.6990 1624.6858 2774.1557 2986.0918 3065.3657 3095.3594 3127.9241 3141.0122 3147.0579 3152.0799 3165.9057 3169.0841 3177.5337
redmass: 7.1714 5.2220 4.7751 1.0918 6.2929 5.2812 7.0196 4.6527 4.2452 5.7978 4.2032 4.0537 5.0804 8.9141 6.4505 6.1616 4.4962 4.2344 4.0854 5.7256 3.3715 4.5613 6.6687 6.3143 5.4089 6.7516 2.9731 1.6438 1.5385 4.8564 2.7057 4.8462 1.4209 1.3606 1.0769 1.4060 2.3401 1.3447 1.3405 3.7754 3.1323 1.5290 2.1701 1.8200 1.7228 1.0717 1.2611 2.4748 2.8582 1.4864 2.2872 2.3573 3.3422 7.9319 3.1187 1.4182 2.2738 2.9048 2.1745 1.0457 2.5491 1.2634 3.8659 6.1443 4.6021 6.6785 4.6140 1.0711 1.0365 1.0967 1.1006 1.0886 1.0859 1.0896 1.0906 1.0953 1.0991 1.1006
irintensity: 1.9529 0.1275 0.8709 0.3961 0.4691 0.6470 0.2385 1.2937 0.9433 0.8416 1.7333 1.9537 3.7915 5.1781 10.9920 5.8998 5.0266 8.1015 0.8881 7.6577 0.3867 4.5927 29.8373 4.1659 14.8540 8.6953 11.2631 79.9095 40.2127 7.7628 21.9639 20.5018 0.4208 3.6165 107.1678 2.4740 9.6883 1.6461 0.4682 34.3821 25.3395 7.7562 18.5811 28.3564 2.3519 2.0922 3.5979 20.6264 9.8274 3.1342 70.7186 164.8769 273.4960 12.2678 6.8165 74.5950 61.2261 169.9075 3.9147 13.8438 14.9914 37.5375 29.6191 11.0869 33.4724 19.3859 150.8030 305.7306 27.2563 13.9821 17.6705 12.6421 0.9119 9.6505 6.2193 8.4989 16.4580 15.4815
temp: 298.150 k
press: 1.00000 atm
elementType: 17 8 8 6 6 6 6 6 6 6 6 6 6 6 6 6 6 1 1 1 1 1 1 1 1 1 1 1
symmnumber: 1
zpe: 548155.0 jmol-1
zpe.correction: 0.208781 hartree
zpe.thermalcorrener: 0.223585 hartree
zpe.thermalcorrenthalpy: 0.224529 hartree
zpe.thermalcorrgfe: 0.165884 hartree
zpe.sumelectzpe: -1149.421325 hartree
zpe.sumelectthermal: -1149.406521 hartree
zpe.sumelectthermalent: -1149.405577 hartree
zpe.sumelectthermalfe: -1149.464222 hartree
dipole: -1.8097 -1.7196 -2.9528
dipole: 3.8667
quadrupole: -85.3456 -105.9633 -107.4217
quadrupole: -4.3821 2.4624 -2.2670
quadrupole: 14.2313 -6.3864 -7.8448 -4.3821 2.4624 -2.2670
hfenergy: -1149.630106 hartree
pointgroup: C01 [X(C14H11Cl1O2)]
dipole: -0.604696 -1.3748788 0.2414955 debye
polarizability: 240.8945364|20.8086716|123.5729842|15.0488024|-17.4173955|146.906698 unknown
InChI: InChI=1S/C14H11ClO2/c1-9-5-4-7-11(13(9)16)14(17)10-6-2-3-8-12(10)15/h2-8,16H,1H3
charge 0 multiplicity 1
28 atoms
Cl -1.383808 0.700528 2.211238
O  2.401114 1.592835 -1.26464
O  -0.099043 1.483118 -1.614694
C  0.990833 -0.109416 -0.186847
C  2.278766 0.487023 -0.454639
C  3.472956 -0.052351 0.11163
C  -0.202328 0.496633 -0.77994
C  -1.587711 -0.031098 -0.507929
C  0.932366 -1.283686 0.624344
C  3.356269 -1.202822 0.914324
C  2.100916 -1.827111 1.167419
C  4.798889 0.615067 -0.177321
C  -2.223809 -0.016783 0.75559
C  -2.337188 -0.509451 -1.616917
C  -3.539574 -0.487337 0.935892
C  -3.650107 -0.996567 -1.456217
C  -4.250416 -0.991299 -0.175889
H  -0.036895 -1.756669 0.810173
H  4.26696 -1.631908 1.349561
H  2.055596 -2.728208 1.786756
H  4.992658 0.654839 -1.26472
H  4.797699 1.663834 0.171856
H  5.629664 0.079722 0.312442
H  -1.869332 -0.487919 -2.606559
H  -4.000929 -0.447207 1.926792
H  -4.203413 -1.369527 -2.32385
H  -5.271761 -1.36179 -0.039403
H  1.453227 1.820052 -1.614051
