program: Gaussian 09
title: 000223471
version: EM64L-G09RevD.01
frameworkgroup: C1[X(C13H11ClO2)]
method: RPBEPBE
basis: SDD
operation: Freq
keyword: #p
keyword: freq=noraman
keyword: PBEPBE/SDD
title: #p freq=noraman PBEPBE/SDD
converged: YES YES NO NO
title: Mulliken charges:
elementType: Cl O O C C C C C C C C C C C C C H H H H H H H H H H H
charge: -0.070446 -0.454642 -0.431517 -0.708920 0.374050 0.518279 0.177042 -0.330137 -0.432761 -0.361889 -0.562960 -0.381831 0.317805 -0.205729 -0.212944 -0.106369 0.251859 0.214929 0.235031 0.230702 0.263517 0.212249 0.252380 0.252011 0.250234 0.357476 0.352580
chargesum: 0.00000
title: Mulliken charges with hydrogens summed into heavy atoms:
elementType: Cl O O C C C C C C C C C C C C C
charge: -0.070446 -0.097167 -0.078937 -0.242133 0.374050 0.518279 0.177042 -0.095105 -0.202059 -0.098372 -0.350711 -0.129451 0.317805 0.046283 0.037290 -0.106369
polarizability: 2.05948277e+02 6.98817587e+00 1.34853043e+02 -7.65397482e+00 -1.79443189e+01 1.19828030e+02
1716.lowfreq: -4.3691 -0.0013 0.0009 0.0011 6.7119 8.2498 19.1142 27.3689 41.5945
frequency: 16.9726 27.2071 41.5213 96.8304 140.5709 185.3322 219.8069 274.7313 288.3331 304.9381 322.9622 328.0376 338.5907 366.2963 396.6185 408.7433 440.3896 463.1362 483.6444 529.8979 548.4994 599.5996 626.7097 631.0259 700.3265 709.4505 726.9345 769.5825 791.5075 802.5739 818.7546 831.5126 850.6110 915.8006 947.4084 950.9298 957.7866 970.8046 1000.0704 1068.5871 1071.7961 1101.8012 1126.7095 1150.6343 1172.0454 1180.6443 1184.5889 1196.5514 1216.1422 1291.7787 1296.5815 1306.0730 1313.4710 1376.4048 1395.0944 1402.6999 1426.4559 1467.8004 1477.9767 1517.3481 1587.5304 1598.7158 1607.1024 1632.0084 3002.9208 3060.2455 3099.1969 3126.2189 3132.0815 3143.3648 3166.1508 3169.6233 3179.8263 3584.5159 3585.9707
redmass: 4.1158 7.6809 5.6237 7.3757 6.5800 8.0259 5.7058 4.6309 5.7858 2.9477 4.0620 1.1693 1.4453 2.2977 6.3485 2.9189 2.9009 3.5363 4.0764 4.1389 6.5283 5.2982 6.5706 3.7237 3.1124 4.5155 6.5805 2.0112 2.0949 3.8005 1.4812 1.2610 2.0049 1.8873 1.5145 2.0980 1.6796 1.3628 4.5067 2.3964 2.5020 1.4235 1.5305 1.2184 1.2102 1.2218 1.2140 2.5458 2.1878 1.4841 2.8019 1.4370 1.4017 7.0583 3.0810 4.7335 3.2835 1.2941 1.8328 2.8871 7.4239 6.2427 6.7434 6.8385 1.0601 1.1017 1.0913 1.0899 1.0901 1.0890 1.0953 1.0966 1.0951 1.0661 1.0661
irintensity: 0.3267 0.0060 0.2618 1.1656 0.6512 1.2212 0.0718 1.1730 0.6695 17.1888 13.7667 178.6972 59.9991 3.0936 3.3745 0.1403 35.5903 15.2191 16.5908 31.6013 11.0681 11.0197 0.4432 7.4855 5.6278 13.3382 3.8855 12.5718 35.3962 30.6555 43.3649 1.1493 34.3699 2.0448 5.6263 22.4092 16.5733 0.9610 42.5235 91.6586 45.7945 67.0828 213.2067 80.7852 8.1498 0.0593 0.3539 7.6818 22.4164 8.0306 14.7192 29.3165 26.4866 1.3425 6.6614 3.9468 22.4244 42.6421 76.9334 73.1025 1.7656 3.8279 84.2858 60.3675 27.2882 4.7733 17.4879 11.8246 11.3741 1.6828 8.5821 1.0515 4.3385 37.7494 29.8284
temp: 298.150 k
press: 1.00000 atm
elementType: 17 8 8 6 6 6 6 6 6 6 6 6 6 6 6 6 1 1 1 1 1 1 1 1 1 1 1
symmnumber: 1
zpe: 533780.3 jmol-1
zpe.correction: 0.203306 hartree
zpe.thermalcorrener: 0.217665 hartree
zpe.thermalcorrenthalpy: 0.218610 hartree
zpe.thermalcorrgfe: 0.159779 hartree
zpe.sumelectzpe: -1111.351849 hartree
zpe.sumelectthermal: -1111.337490 hartree
zpe.sumelectthermalent: -1111.336546 hartree
zpe.sumelectthermalfe: -1111.395377 hartree
dipole: 3.8412 2.2889 -0.1648
dipole: 4.4745
quadrupole: -102.9968 -93.1288 -95.2782
quadrupole: 13.6511 -11.2773 -11.1787
quadrupole: -5.8622 4.0058 1.8564 13.6511 -11.2773 -11.1787
hfenergy: -1111.5551552 hartree
pointgroup: C01 [X(C13H11Cl1O2)]
dipole: 1.4482745 0.9931102 0.1234528 debye
polarizability: 205.0043866|12.6991942|140.8545512|-1.9296908|-14.9764607|114.7704124 unknown
InChI: InChI=1S/C13H11ClO2/c14-11-4-1-9(2-5-11)7-10-3-6-12(15)8-13(10)16/h1-6,8,15-16H,7H2
charge 0 multiplicity 1
27 atoms
Cl -5.282375 -0.553378 -1.510846
O  1.365748 2.438364 0.429254
O  4.714928 -0.615094 -1.529533
C  -0.03471 0.275595 1.651347
C  1.220768 0.060718 0.809741
C  -1.335457 0.069468 0.872615
C  1.904569 1.149872 0.21245
C  1.749556 -1.233445 0.582896
C  -2.209361 -1.001432 1.183391
C  -1.693936 0.950425 -0.181883
C  3.070249 0.963808 -0.568367
C  2.904663 -1.455855 -0.192529
C  3.563888 -0.346849 -0.767154
C  -3.411852 -1.202363 0.465209
C  -2.890167 0.769502 -0.909438
C  -3.731135 -0.309716 -0.573214
H  -0.013556 1.302213 2.05899
H  -0.014251 -0.420075 2.510606
H  1.236639 -2.093078 1.030127
H  -1.956136 -1.691076 1.99757
H  -1.030529 1.786494 -0.428959
H  3.581885 1.826801 -1.018513
H  3.303717 -2.459619 -0.359236
H  -4.081829 -2.031624 0.710477
H  -3.16385 1.453027 -1.718753
H  1.949771 3.136554 0.042849
H  5.103663 0.217464 -1.895698
