program: Gaussian 09
title: 000223463
version: EM64L-G09RevD.01
frameworkgroup: C1[X(C14H13Cl)]
method: RPBEPBE
basis: SDD
operation: Freq
keyword: #p
keyword: freq=noraman
keyword: PBEPBE/SDD
title: #p freq=noraman PBEPBE/SDD
converged: NO YES NO NO
title: Mulliken charges:
elementType: Cl C C C C C C C C C C C C C C H H H H H H H H H H H H H
charge: -0.063698 -0.587053 -0.580628 0.531620 0.514434 -0.394999 -0.395152 -0.405967 -0.406080 -0.213366 -0.213326 -0.227240 -0.227212 -0.106685 -0.242306 0.226585 0.226574 0.223544 0.223534 0.237559 0.237571 0.230111 0.230124 0.252759 0.252763 0.224163 0.224166 0.228205
chargesum: 0.00000
title: Mulliken charges with hydrogens summed into heavy atoms:
elementType: Cl C C C C C C C C C C C C C C
charge: -0.063698 -0.133894 -0.133550 0.531620 0.514434 -0.157440 -0.157581 -0.175856 -0.175956 0.039393 0.039437 -0.003076 -0.003046 -0.106685 -0.014101
polarizability: 2.43735398e+02 -2.40882961e-04 1.50343151e+02 -1.75949436e+01 -5.93896454e-04 7.43035020e+01
1716.lowfreq: -7.6230 0.0022 0.0026 0.0032 4.4144 16.2560 21.8185 28.4961 40.7350
frequency: 21.7638 28.4510 40.7343 42.8932 94.6641 154.6710 235.0283 245.1170 324.8547 336.9537 375.2872 383.3866 404.0255 408.9204 482.3420 524.0375 558.3136 617.3807 627.2086 644.0602 705.1907 715.2304 756.2147 788.4711 788.7452 813.5557 831.0171 853.6820 856.9560 917.6536 948.6651 965.9878 975.7138 985.8359 990.0233 993.0169 999.6201 1003.4110 1026.2114 1072.2793 1073.3319 1106.2463 1144.3858 1172.2048 1183.5272 1186.7435 1215.4506 1218.7795 1268.2076 1270.2487 1298.3292 1324.1113 1327.2874 1375.6957 1382.0037 1395.4409 1440.0845 1473.1077 1478.4263 1483.3849 1488.7869 1586.2552 1592.8886 1600.8239 1613.6225 2987.5047 2996.8933 3036.2992 3063.2739 3112.0040 3112.6088 3125.4995 3127.8750 3130.4385 3142.6859 3161.6871 3166.3195 3169.4451
redmass: 3.9336 4.5429 7.1651 3.0113 5.7284 7.1233 4.2068 4.7788 2.3776 5.0603 2.7465 8.7374 2.8186 2.8950 3.4317 2.8282 5.4351 6.3668 6.9085 4.9285 1.7398 3.8378 1.9254 5.1610 1.1874 1.7609 1.2464 1.2473 2.5105 1.5237 1.3798 1.3717 1.3935 1.6614 6.2368 1.4085 4.0774 3.7884 2.1934 2.7504 1.5250 1.3414 1.1174 1.0517 1.1235 1.1164 2.5675 2.4952 1.2351 1.4220 1.2701 1.3907 1.2565 6.8797 8.1114 2.6849 2.1743 1.3109 1.9725 2.1459 1.0998 7.3224 6.0538 6.3404 6.1744 1.0591 1.0597 1.1014 1.1050 1.0883 1.0864 1.0897 1.0897 1.0902 1.0956 1.1014 1.0948 1.0959
irintensity: 0.0671 0.1986 0.0603 0.0402 0.1863 0.0247 0.1800 1.0156 0.0026 1.2065 0.4066 8.8027 0.0000 0.0000 2.0018 53.4870 1.3605 0.0625 0.1075 14.3863 52.8114 6.0770 28.0263 4.0283 0.3464 68.9600 0.0004 0.0003 15.5984 2.3213 0.0541 0.0295 0.0065 0.1221 0.2389 0.1664 32.4345 8.5395 7.0338 39.3809 12.1200 0.9540 11.2122 0.1528 0.2737 0.0921 0.5020 0.3248 0.0008 10.3833 0.1617 0.0069 0.1275 0.0156 0.0101 3.5915 6.3614 11.4150 89.1233 15.5243 12.8655 0.6086 1.7625 2.6091 12.8538 1.5262 58.6029 0.1509 25.1534 6.1006 15.0831 11.8219 13.7348 7.7824 43.8827 26.9634 8.3471 0.4396
temp: 298.150 k
press: 1.00000 atm
elementType: 17 6 6 6 6 6 6 6 6 6 6 6 6 6 6 1 1 1 1 1 1 1 1 1 1 1 1 1
symmnumber: 1
zpe: 589576.4 jmol-1
zpe.correction: 0.224558 hartree
zpe.thermalcorrener: 0.237799 hartree
zpe.thermalcorrenthalpy: 0.238743 hartree
zpe.thermalcorrgfe: 0.181350 hartree
zpe.sumelectzpe: -1000.295228 hartree
zpe.sumelectthermal: -1000.281987 hartree
zpe.sumelectthermalent: -1000.281043 hartree
zpe.sumelectthermalfe: -1000.338436 hartree
dipole: -2.3577 -0.0001 0.3794
dipole: 2.3881
quadrupole: -104.6982 -83.2567 -101.7364
quadrupole: -0.0002 -1.4294 0.0009
quadrupole: -8.1345 13.3071 -5.1727 -0.0002 -1.4294 0.0009
hfenergy: -1000.5197861 hartree
pointgroup: C01 [X(C14H13Cl1)]
dipole: -0.9243961 0.0004937 0.1680269 debye
polarizability: 242.9536519|-0.0473405|150.343085|-21.0099294|0.0955428|75.0853133 unknown
InChI: InChI=1S/C14H13Cl/c15-14-10-8-13(9-11-14)7-6-12-4-2-1-3-5-12/h1-5,8-11H,6-7H2
charge 0 multiplicity 1
28 atoms
Cl 6.048768 -0.006202 -0.483827
C  -0.012527 -0.003034 0.69395
C  -0.840607 -0.001127 -0.63395
C  1.485578 -0.003877 0.437882
C  -2.339122 -0.000184 -0.373774
C  2.200032 -1.221161 0.291466
C  2.202185 1.212666 0.296003
C  -3.052496 -1.218274 -0.228195
C  -3.05085 1.218789 -0.227587
C  3.584778 -1.234302 0.010992
C  3.586962 1.224399 0.015573
C  -4.436674 -1.220689 0.05676
C  -4.435025 1.222933 0.057395
C  4.258021 -0.005286 -0.124746
C  -5.133345 0.001559 0.202153
H  -0.30396 -0.892194 1.284408
H  -0.302638 0.885423 1.286101
H  -0.551716 -0.890015 -1.226557
H  -0.550349 0.88846 -1.224833
H  1.672516 -2.176155 0.40459
H  1.676346 2.168155 0.412676
H  -2.520166 -2.17089 -0.347387
H  -2.51723 2.170744 -0.346274
H  4.128211 -2.177935 -0.095058
H  4.132068 2.167454 -0.08695
H  -4.971685 -2.171683 0.160557
H  -4.968741 2.174599 0.161707
H  -6.207233 0.002226 0.420424
