program: Gaussian 09
title: 000223458
version: EM64L-G09RevD.01
frameworkgroup: C1[X(C10H12N4)]
method: RPBEPBE
basis: SDD
operation: Freq
keyword: #pfreq=noraman
keyword: PBEPBE/SDD
title: #p freq=noraman PBEPBE/SDD
converged: YES YES NO NO
title: Mulliken charges:
elementType: N N N N C C C C C C C C C C H H H H H H H H H H H H
charge: -0.037072 -0.134143 -0.358342 -0.007067 -0.392511 -0.577491 -0.435661 0.509324 0.092338 -0.422920 -0.402423 -0.224004 -0.230473 -0.244143 0.226212 0.224392 0.260284 0.198535 0.237080 0.222643 0.235376 0.228960 0.222894 0.222335 0.226342 0.359536
chargesum: 0.00000
title: Mulliken charges with hydrogens summed into heavy atoms:
elementType: N N N N C C C C C C C C C C
charge: -0.037072 -0.134143 0.001194 -0.007067 0.058094 -0.118673 0.024063 0.509324 0.092338 -0.187545 -0.173463 -0.001110 -0.008138 -0.017802
polarizability: 1.68316550e+02 9.66436127e+00 1.26054550e+02 -1.21825898e+00 4.25140264e+00 8.62732581e+01
1716.lowfreq: -0.0002 0.0006 0.0008 1.6564 2.8059 14.4689 21.0889 24.8086 33.0009
frequency: 19.7191 24.7155 32.7845 78.8656 100.8521 164.8615 234.8087 268.3117 329.2431 338.5417 403.5541 435.0953 497.4673 587.0280 617.6486 635.1307 646.2028 706.1713 720.2712 742.6116 754.0552 786.2327 813.2338 854.1357 858.1801 915.9607 920.2792 950.3182 968.9940 975.6559 990.0456 993.2342 1009.4231 1019.3859 1026.6089 1052.3323 1086.7494 1094.7367 1126.1451 1150.5845 1165.7933 1171.4211 1186.5990 1217.9310 1273.1607 1278.0122 1309.5966 1315.6901 1328.8009 1348.8080 1382.2542 1401.1329 1439.9612 1445.9319 1463.2378 1473.2164 1483.7102 1487.6618 1592.6678 1614.4291 2982.1053 2990.6120 3003.7997 3038.3492 3063.5598 3073.6292 3110.6518 3116.0838 3130.3638 3141.6790 3160.8295 3607.1513
redmass: 5.8470 4.8028 4.5905 4.0071 4.6276 2.6329 5.9777 3.5916 2.3115 2.4253 2.8214 3.8101 3.2671 4.0182 6.3599 6.3464 3.5801 1.7438 1.2393 3.1291 2.0493 1.8749 2.2729 1.2865 2.1767 1.4803 4.9550 10.0670 2.4946 1.3925 6.2421 1.3175 7.0840 2.0953 2.2096 2.6786 1.6657 6.6158 2.0192 2.5040 1.8030 1.0570 1.1173 2.4632 1.6320 1.2751 1.2776 1.3395 1.2537 1.4348 7.4246 1.5898 2.1409 1.5767 1.2811 1.8156 2.2284 1.1260 6.0314 6.1825 1.0622 1.0615 1.0630 1.0971 1.1022 1.1008 1.0871 1.0865 1.0908 1.0958 1.1015 1.0845
irintensity: 2.5587 1.0949 1.2411 0.4723 0.5282 2.4697 2.2603 1.4016 5.6101 1.2303 0.0027 5.2291 12.2745 5.3882 0.1070 12.8726 3.5479 50.6433 114.9069 4.5592 44.0755 10.1960 2.4859 0.2530 2.3760 3.7536 10.6307 11.5728 7.3105 0.0852 0.1371 0.2811 0.6837 3.9682 6.0654 3.6091 5.1385 15.5807 15.7396 3.7277 14.6089 0.6029 0.1520 0.1565 3.7030 1.3376 2.0582 2.2774 0.1291 15.7956 0.8985 11.8947 7.2041 24.3509 12.6721 16.6877 26.2601 11.4991 1.2863 10.7083 6.0359 46.2312 15.0083 7.0329 31.7872 13.9740 10.7926 6.0055 11.2594 47.5536 25.1118 106.3047
temp: 298.150 k
press: 1.00000 atm
elementType: 7 7 7 7 6 6 6 6 6 6 6 6 6 6 1 1 1 1 1 1 1 1 1 1 1 1
symmnumber: 1
zpe: 548661.3 jmol-1
zpe.correction: 0.208974 hartree
zpe.thermalcorrener: 0.221139 hartree
zpe.thermalcorrenthalpy: 0.222083 hartree
zpe.thermalcorrgfe: 0.167036 hartree
zpe.sumelectzpe: -606.203285 hartree
zpe.sumelectthermal: -606.191120 hartree
zpe.sumelectthermalent: -606.190176 hartree
zpe.sumelectthermalfe: -606.245223 hartree
dipole: -1.0409 0.7347 -2.0095
dipole: 2.3793
quadrupole: -69.2970 -75.5917 -90.2649
quadrupole: 3.6937 5.4496 6.7645
quadrupole: 9.0876 2.7928 -11.8804 3.6937 5.4496 6.7645
hfenergy: -606.4122593 hartree
pointgroup: C01 [X(C10H12N4)]
dipole: 0.3938966 -0.2491899 -0.8118171 debye
dipolederiv: -0.1188904 -0.0214249 -0.0658085 0.1300134 -0.1300536 -0.21269 0.1827264 0.0257625 -0.2931732 -0.3373197 -0.0817061 0.0983802 -0.2291156 -0.275804 0.1340723 -0.1360116 -0.0742877 -0.1545345 -0.4136903 -0.0702591 0.1250468 -0.2229466 -0.1371218 0.2110529 0.1114003 0.1727816 -0.0773066 0.0401438 0.0351896 -0.2425672 0.0164172 -0.1517563 -0.1119622 -0.2510809 -0.1306846 0.1067096 0.1783948 0.0591424 0.0001788 -0.0911728 0.0761724 -0.0146184 -0.1319899 0.0248869 0.095972 -0.0956152 0.0468452 -0.0028739 0.1211358 0.0871596 -0.052877 0.1250598 -0.0860716 0.0913589 -0.1427911 -0.07091 0.0014364 0.0358004 0.0918944 -0.0253046 0.0744829 -0.0375267 0.1230114 0.3790252 -0.1043555 0.0342604 -0.1491211 -0.0083827 -0.0093012 0.0840856 -0.0190866 -0.0586428 0.3397775 0.2644187 0.0236054 0.4492604 0.3173452 0.0339889 0.0514879 0.0657876 0.0259753 -0.1066209 0.0892264 0.0168739 0.1605712 -0.0173184 -0.0144284 -0.0145807 -0.0126558 -0.1525222 -0.2035614 0.018864 0.0221501 -0.0295236 0.0730161 -0.0628821 0.0166324 -0.0469416 -0.146762 -0.0187037 -0.0138819 0.0272712 -0.0380579 0.1166451 -0.0539178 0.0283241 -0.0544099 -0.1284006 0.0534702 0.0693484 0.0179422 0.0935992 0.0484671 -0.0299725 0.0149858 -0.0308849 -0.1379063 0.0314684 -0.0362679 0.0582126 -0.0352009 -0.0884259 -0.029604 0.0444071 -0.0253143 -0.1639065 -0.0661447 -0.1263456 -0.0409979 -0.0840884 -0.0683415 -0.0823472 -0.0227838 -0.0425867 0.0461991 0.0545647 0.0253076 0.0105385 0.0264151 -0.0153099 0.1179022 -0.002898 0.0756563 -0.0607338 0.0750345 -0.0204174 -0.0377168 -0.0875923 -0.0477332 -0.0552383 -0.0287292 -0.026535 0.0535238 0.0135806 0.0140008 0.001226 0.0379315 -0.0440665 0.1366622 -0.0263442 0.0866891 -0.0517777 -0.0335342 0.0534473 0.0670284 0.0181099 0.0218052 -0.054356 0.0591246 -0.1107799 -0.0098176 0.0710727 -0.0346903 -0.0092199 -0.0382727 0.0033515 0.0602228 -0.0628777 0.1218551 -0.0415807 -0.0267129 -0.1152845 -0.0144877 -0.1080629 0.0092558 0.0161133 -0.015167 0.0082016 0.1334437 0.0850933 0.0656394 -0.0347746 0.0526939 -0.0983476 0.0586064 -0.031369 0.0608065 0.1213453 0.063165 0.0406621 -0.0214885 0.0612585 -0.113765 0.0602699 -0.0302688 0.0612623 0.1386973 -0.0517243 -0.1073953 -0.0064758 -0.123253 -0.0154741 0.0180795 -0.0108516 0.0193444 0.149679 -0.1204835 0.0535304 -0.0567526 0.055562 0.0734244 0.0277367 -0.0611587 0.027819 0.1476334 0.3510014 -0.0326839 0.0290124 -0.0223608 0.2933637 -0.0652075 0.033394 -0.0530876 0.2435161 unknown
polarizability: 167.8560059|10.5397657|126.8071617|-0.5653965|-2.9941401|85.9811903 unknown
InChI: InChI=1S/C10H12N4/c1-2-5-9(6-3-1)7-4-8-10-11-13-14-12-10/h1-3,5-6,13H,4,7-8H2
charge 0 multiplicity 1
26 atoms
N  3.659128 -0.051214 -1.16567
N  2.774685 0.431072 0.900223
N  4.242472 1.038383 -0.574609
N  3.735568 1.362396 0.676127
C  0.320058 -1.153555 -0.618136
C  -0.371198 -0.561132 0.641473
C  1.799345 -1.573045 -0.379991
C  -1.807577 -0.149637 0.352798
C  2.736888 -0.414942 -0.217713
C  -2.127617 1.191292 0.017315
C  -2.855338 -1.107611 0.370178
C  -3.454403 1.565743 -0.295749
C  -4.183298 -0.739283 0.05859
C  -4.4877 0.600532 -0.277907
H  -0.242683 -2.046957 -0.951372
H  0.270128 -0.422386 -1.447939
H  0.215791 0.300633 1.006952
H  -0.345481 -1.324392 1.444684
H  2.155277 -2.174365 -1.235034
H  1.851945 -2.209986 0.523389
H  -1.331466 1.946299 0.009507
H  -2.628835 -2.147719 0.638667
H  -3.682902 2.607795 -0.547709
H  -4.979624 -1.492224 0.082485
H  -5.517382 0.889309 -0.517326
H  4.995024 1.567194 -1.014329
