program: Gaussian 09
title: 000018953
version: EM64L-G09RevD.01
frameworkgroup: C1[X(C15H16N4)]
method: RPBEPBE
basis: SDD
operation: Freq
keyword: #pfreq=noraman
keyword: PBEPBE/SDD
title: #p freq=noraman PBEPBE/SDD
converged: YES YES NO NO
title: Mulliken charges:
elementType: N N N N C C C C C C C C C C C C C C C H H H H H H H H H H H H H H H H
charge: -0.052067 -0.411941 0.039108 -0.682736 0.393927 -0.537832 -0.397950 -0.385974 -0.226596 -0.231528 -0.244114 0.446167 0.237892 -0.388057 -0.368257 -0.225555 -0.220144 -0.395056 -0.239496 0.222633 0.202349 0.295625 0.217938 0.220276 0.219457 0.222518 0.219078 0.273628 0.224764 0.226219 0.197310 0.227636 0.273114 0.337521 0.310142
chargesum: 0.00000
title: Mulliken charges with hydrogens summed into heavy atoms:
elementType: N N N N C C C C C C C C C C C C C C C
charge: -0.052067 -0.138826 0.039108 -0.035073 0.393927 -0.112849 -0.102325 -0.168036 -0.006320 -0.012071 -0.021596 0.446167 0.237892 -0.168979 -0.094628 -0.000792 0.006075 -0.197746 -0.011860
polarizability: 3.10999566e+02 -2.96966348e+01 2.38601945e+02 -1.01462224e+01 -3.56259209e+00 8.36358416e+01
1716.lowfreq: -5.4520 -2.0925 -0.0009 -0.0007 -0.0003 4.5447 16.3415 24.3448 27.3856
frequency: 16.1183 24.3381 27.3574 47.6268 59.9722 88.3152 126.3316 175.1149 195.2992 220.8950 224.3005 246.9139 263.0841 302.4358 344.3814 392.3898 405.5407 406.5127 437.6477 451.6517 463.7796 495.2400 514.6029 563.1433 578.9292 614.0340 615.8640 626.4098 662.0712 676.2363 699.4271 705.2546 737.2530 769.8242 804.1289 839.5954 852.4687 857.3314 903.3923 908.5484 913.5266 939.5794 979.0303 980.5558 984.7602 986.8214 989.0304 1001.3363 1013.1546 1016.4320 1023.2821 1025.5464 1074.3236 1079.7832 1118.6764 1130.1354 1167.2368 1171.3028 1176.9795 1183.1281 1203.6602 1221.5743 1238.4583 1287.1518 1306.4906 1315.0761 1339.0313 1344.9234 1387.6555 1388.9192 1435.9223 1437.7625 1442.6567 1480.1261 1481.5940 1513.0334 1568.2144 1593.4762 1594.2881 1612.7528 1615.2272 1615.5621 1674.2096 2866.0253 2919.4554 2953.6511 3100.1976 3112.2577 3120.1814 3127.1674 3134.1355 3140.0620 3152.9860 3155.6071 3165.2665 3166.7418 3376.9334 3539.2123 3686.5598
redmass: 4.0839 4.9303 3.8242 4.0262 4.6964 4.9076 4.7515 4.8648 2.9338 3.9887 2.7771 3.4336 5.6713 3.7520 4.6885 1.2332 2.8394 2.8627 1.2436 4.3403 2.7456 3.6642 2.8734 1.3133 5.7155 6.3917 6.4309 5.2717 5.5862 5.7028 1.7407 2.3641 1.3612 1.7729 4.3364 4.4918 1.2548 1.2572 2.0431 1.3898 2.2802 1.5729 1.4124 1.3706 1.6515 6.2487 6.1395 1.3326 1.4207 2.1160 2.1504 2.1051 1.5660 1.6351 3.8828 3.7472 1.0664 1.0577 1.1276 1.1139 2.4490 1.0766 1.8753 1.7422 1.8961 1.5345 1.5187 1.5482 6.4674 6.0948 1.8118 2.3141 1.2323 2.1591 2.3139 2.0358 6.3282 5.4473 6.0485 6.0247 1.6854 2.5449 5.9214 1.0606 1.0944 1.0861 1.0876 1.0873 1.0862 1.0865 1.0926 1.0922 1.0973 1.0958 1.0975 1.1004 1.0743 1.0458 1.1022
irintensity: 0.4076 0.0600 0.1924 1.2713 7.5533 3.7850 4.8441 0.8348 0.3127 4.3239 33.8243 6.8970 1.4025 1.0312 2.8480 58.6331 0.2303 0.0686 275.5351 7.0589 4.5320 12.9365 7.4884 102.8911 2.8065 0.6533 1.2245 18.5342 6.9892 7.3248 47.0476 28.8030 87.6729 44.5599 1.2239 3.1962 0.6306 0.2535 0.1097 10.2304 2.1079 32.8297 0.2112 0.1432 1.9739 0.7233 0.1876 1.0842 3.4934 20.5682 9.3396 10.2279 10.9023 22.2220 28.4517 189.5741 1.9779 0.2057 9.5037 0.4862 7.0085 2.2289 6.1065 253.7447 146.0706 5.6537 25.2321 14.4696 18.6656 2.0251 48.2244 5.7410 20.8498 66.2181 24.1918 273.0724 42.1137 31.5149 4.9327 0.9819 86.4069 63.3669 527.5621 76.0799 41.5481 67.6120 14.8915 11.3473 1.4671 0.1341 38.4260 28.7827 29.7828 28.1919 15.4942 22.6114 1.5028 31.1265 16.5713
temp: 298.150 k
press: 1.00000 atm
elementType: 7 7 7 7 6 6 6 6 6 6 6 6 6 6 6 6 6 6 6 1 1 1 1 1 1 1 1 1 1 1 1 1 1 1 1
symmnumber: 1
zpe: 736376.8 jmol-1
zpe.correction: 0.280471 hartree
zpe.thermalcorrener: 0.297855 hartree
zpe.thermalcorrenthalpy: 0.298799 hartree
zpe.thermalcorrgfe: 0.232007 hartree
zpe.sumelectzpe: -798.805521 hartree
zpe.sumelectthermal: -798.788137 hartree
zpe.sumelectthermalent: -798.787193 hartree
zpe.sumelectthermalfe: -798.853985 hartree
dipole: 0.6416 4.9976 0.8330
dipole: 5.1070
quadrupole: -96.5877 -80.4110 -119.5713
quadrupole: -4.9564 -3.9961 1.6234
quadrupole: 2.2690 18.4457 -20.7147 -4.9564 -3.9961 1.6234
hfenergy: -799.0859918 hartree
pointgroup: C01 [X(C15H16N4)]
dipole: 0.3307618 1.9320516 0.4414429 debye
polarizability: 307.1531264|-30.3117124|239.9431866|-25.4990819|9.1533542|86.1410403 unknown
InChI: InChI=1S/C15H16N4/c16-15(17-11-13-7-3-1-4-8-13)19-18-12-14-9-5-2-6-10-14/h1-10,12,19H,11,16H2
charge 0 multiplicity 1
35 atoms
N  -1.44418 1.466753 -0.141832
N  0.696279 2.470122 0.082994
N  1.38307 1.281378 0.044745
N  -1.15721 3.742265 0.675775
C  -3.477751 0.064739 0.10288
C  -2.889068 1.477199 0.13456
C  -2.662267 -1.063353 -0.147232
C  -4.864732 -0.122034 0.330585
C  -3.226551 -2.360307 -0.166159
C  -5.429522 -1.416445 0.311317
C  -4.609785 -2.542964 0.062683
C  3.484127 0.102997 -0.270018
C  -0.7177 2.490288 0.199542
C  4.870182 0.197673 -0.576301
C  2.925542 -1.179052 0.005785
C  5.681009 -0.957339 -0.60661
C  3.737766 -2.328277 -0.026375
C  2.668052 1.323375 -0.248352
C  5.118913 -2.225202 -0.331735
H  -3.423337 2.087902 -0.630139
H  -3.1310 1.937185 1.12468
H  -1.596199 -0.892366 -0.325015
H  -5.508385 0.746906 0.525164
H  -2.585711 -3.228375 -0.361014
H  -6.503334 -1.547167 0.489492
H  -5.045253 -3.548785 0.047501
H  5.310571 1.179986 -0.791393
H  1.857995 -1.243468 0.239757
H  6.747164 -0.86964 -0.844236
H  3.298967 -3.309828 0.186118
H  3.188233 2.274922 -0.489264
H  5.746583 -3.123038 -0.354972
H  1.163589 3.360147 -0.148587
H  -2.142861 3.97935 0.604017
H  -0.583195 4.286856 1.31714
