program: Gaussian 09
title: 000223446
version: EM64L-G09RevD.01
frameworkgroup: C1[X(C5H11N5)]
method: RPBEPBE
basis: SDD
operation: Freq
keyword: #pfreq=noraman
keyword: PBEPBE/SDD
title: #p freq=noraman PBEPBE/SDD
converged: YES YES NO NO
title: Mulliken charges:
elementType: N N N N N C C C C C H H H H H H H H H H H
charge: -0.188605 -0.055935 -0.168319 -0.617559 -0.093834 -0.347715 -0.392200 -0.333490 -0.685957 0.263030 0.190829 0.230534 0.213135 0.255469 0.191468 0.205469 0.222640 0.218824 0.209377 0.350038 0.332802
chargesum: 0.00000
title: Mulliken charges with hydrogens summed into heavy atoms:
elementType: N N N N N C C C C C
charge: -0.188605 -0.055935 -0.168319 0.065281 -0.093834 0.073648 0.076404 0.063447 -0.035117 0.263030
polarizability: 1.04475532e+02 1.75601440e+00 9.06593463e+01 8.55218718e+00 4.50453461e-01 6.18686240e+01
1716.lowfreq: -17.9151 -0.0005 -0.0004 0.0004 6.0334 9.4616 35.2372 66.1777 74.9342
frequency: 34.1861 66.1193 74.9190 107.8623 191.3732 218.6466 228.0890 250.3173 283.3685 326.8397 412.6082 423.1582 460.0946 642.8841 693.0218 712.1255 733.0654 746.5855 777.4860 870.3795 902.1506 931.3778 961.1635 991.8115 1018.9479 1040.5338 1072.2792 1114.0643 1130.4303 1182.5549 1227.3472 1246.5620 1270.3835 1289.3888 1308.0271 1341.7126 1359.3941 1392.4600 1412.2813 1461.8356 1471.0366 1477.2168 1479.2826 1490.2011 1583.6437 1635.0322 2966.3474 2976.9979 2978.9218 2982.8153 3012.8834 3045.3896 3074.0815 3079.9953 3083.0958 3575.3275 3718.1210
redmass: 3.2690 2.0213 3.4299 2.2559 1.7772 1.5978 1.3957 2.8498 3.0048 4.0306 2.8298 2.7031 1.3316 10.5342 6.2033 7.4897 1.1109 5.5000 1.2761 2.8554 1.7255 1.9397 3.8606 2.1001 3.6267 4.6910 2.4965 2.3583 4.3896 2.3988 2.6237 1.7759 1.2999 1.0800 1.2144 1.3944 1.5283 1.2146 4.4898 1.1088 1.0659 1.0456 1.0624 1.0917 1.9328 2.0340 1.0599 1.0553 1.0439 1.0683 1.0971 1.0990 1.1002 1.0994 1.0984 1.0450 1.1052
irintensity: 7.1238 2.2079 4.9934 0.4156 35.1427 10.8300 38.8281 20.1582 13.5174 10.0622 32.0901 30.5140 144.4269 1.6238 7.0924 5.9090 8.8147 0.8824 4.5590 17.2975 5.6565 8.4767 18.1964 1.6776 6.4372 31.8557 0.6265 9.6726 8.1854 1.2833 1.1594 0.2145 0.7161 1.8066 0.4041 2.8253 15.9863 9.8903 67.8825 7.8831 0.9479 11.2070 5.8755 21.7856 22.3403 292.8511 20.6019 9.6334 30.7813 62.9129 9.4675 16.9763 46.9101 46.1445 33.8757 71.1716 50.4939
temp: 298.150 k
press: 1.00000 atm
elementType: 7 7 7 7 7 6 6 6 6 6 1 1 1 1 1 1 1 1 1 1 1
symmnumber: 1
zpe: 451818.9 jmol-1
zpe.correction: 0.172089 hartree
zpe.thermalcorrener: 0.183046 hartree
zpe.thermalcorrenthalpy: 0.183991 hartree
zpe.thermalcorrgfe: 0.134448 hartree
zpe.sumelectzpe: -470.051269 hartree
zpe.sumelectthermal: -470.040311 hartree
zpe.sumelectthermalent: -470.039367 hartree
zpe.sumelectthermalfe: -470.088909 hartree
dipole: 6.2809 4.5070 2.0698
dipole: 8.0029
quadrupole: -76.4215 -56.9925 -61.2099
quadrupole: -8.5781 -3.1934 0.0415
quadrupole: -11.5469 7.8821 3.6648 -8.5781 -3.1934 0.0415
hfenergy: -470.2233576 hartree
pointgroup: C01 [X(C5H11N5)]
dipole: -2.4846795 -1.8893815 0.4125991 debye
dipolederiv: -0.7361986 0.0703924 0.1288304 -0.294047 -0.3566731 0.0557165 0.1057437 -0.0846031 -0.1630122 0.1299775 0.39188 0.0056256 0.5079205 -0.111937 -0.1391285 -0.0109007 -0.1440559 -0.1437008 -0.3392883 -0.4054797 -0.0588799 0.0690001 -0.6739145 -0.1257884 0.0608223 0.0753326 -0.2237801 -0.2938161 -0.221704 -0.1836638 -0.0673847 -1.1864215 -0.0159216 -0.1899338 0.0392606 -0.638565 -0.2668114 -0.1416998 -0.0439973 -0.0843491 0.3394072 0.1399881 0.0216711 0.1507035 -0.1435042 -0.0837143 -0.0007331 0.0167576 -0.0286687 0.1442112 0.0224382 0.0169205 -0.0039211 -0.0065503 0.5895709 -0.0420905 -0.0721914 -0.0171765 0.1715052 -0.0697048 -0.0955377 -0.0297546 0.3026768 0.0675906 0.0002881 -0.0298427 -0.0044877 0.1786723 -0.0164896 -0.1106452 -0.0054974 0.0957274 -0.0507147 -0.0031613 -0.0456091 -0.0065089 0.0901612 -0.0014926 -0.004542 -0.003604 0.0296609 0.4500654 0.3664003 0.0090348 -0.0415901 1.3083292 0.1377319 -0.0772753 0.0345883 0.2527432 0.0378829 0.0406609 0.0189149 0.0488275 -0.0953674 -0.1234243 0.0225727 -0.0856567 -0.0117542 0.0511362 -0.0263474 0.008252 -0.0194009 -0.0347187 0.1080937 0.0127934 0.0827727 -0.02193 -0.0312607 0.0054292 0.0211832 -0.0341226 -0.0414525 0.1560147 0.01905 0.0758055 -0.0178001 0.0495693 0.0045984 0.0140224 0.0427552 -0.0063114 -0.0990924 0.0139329 -0.0462863 0.0447914 0.0296575 0.0078204 -0.0142072 -0.0200369 -0.0714458 0.1551663 0.0140704 0.1233131 -0.0668372 0.0298573 -0.0031797 -0.0041276 0.0297773 -0.0909793 -0.138681 0.0218889 -0.1137088 -0.0215944 -0.202445 -0.0033787 0.0549775 -0.0057406 0.1036881 -0.002619 0.0797251 -0.0004363 0.0487243 0.0905002 -0.0439742 0.0176351 -0.00464 -0.0614872 0.1356558 -0.0292963 0.109275 -0.0292352 0.0828057 0.0585584 0.0195854 0.01264 -0.0998582 -0.1305598 -0.0224211 -0.1035909 -0.0000053 0.2124457 -0.050359 0.0608363 -0.0516863 0.2611428 -0.0133125 0.0631874 -0.0090528 0.3733488 0.1831897 -0.0039206 0.0768639 -0.0310806 0.2334494 -0.0345909 0.0881738 -0.0608835 0.3405963 unknown
polarizability: 104.7978538|3.2126552|89.7691225|-7.2078887|5.0437294|62.4365264 unknown
InChI: InChI=1S/C5H11N5/c1-2-3-4-10-5(6)7-8-9-10/h2-4,6H2,1H3
charge 0 multiplicity 1
21 atoms
N  0.700164 0.220879 0.443561
N  1.431992 1.449983 0.383782
N  2.702773 -0.246874 -0.44172
N  1.156817 -2.100386 -0.175952
N  2.620168 1.128486 -0.146042
C  -1.732663 0.080311 -0.180178
C  -0.67779 0.188245 0.945005
C  -3.172144 0.069231 0.382033
C  -4.237811 -0.041542 -0.72913
C  1.496049 -0.775445 -0.066723
H  -1.562017 -0.836607 -0.780732
H  -1.603506 0.936504 -0.869205
H  -0.781863 -0.651295 1.661994
H  -0.822404 1.123737 1.511117
H  -3.288167 -0.775446 1.092257
H  -3.34259 0.994963 0.967575
H  -5.258684 -0.043634 -0.306629
H  -4.165827 0.80744 -1.433923
H  -4.111087 -0.973182 -1.311808
H  1.856528 -2.735662 -0.549127
H  0.240161 -2.454809 0.075844
