program: Gaussian 09
title: 000223441
version: EM64L-G09RevD.01
frameworkgroup: C1[X(C4H8N4)]
method: RPBEPBE
basis: SDD
operation: Freq
keyword: #p
keyword: freq=noraman
keyword: PBEPBE/SDD
title: #p freq=noraman PBEPBE/SDD
converged: NO YES NO NO
title: Mulliken charges:
elementType: N N N N C C C C H H H H H H H H
charge: -0.040856 -0.132720 -0.357867 -0.007897 -0.401546 -0.358255 0.087604 -0.677873 0.222589 0.222572 0.212024 0.226732 0.213108 0.211312 0.224085 0.356988
chargesum: 0.00000
title: Mulliken charges with hydrogens summed into heavy atoms:
elementType: N N N N C C C C
charge: -0.040856 -0.132720 -0.000879 -0.007897 0.043615 0.080501 0.087604 -0.029368
polarizability: 8.97531390e+01 1.00708473e+00 6.40791456e+01 5.44136541e+00 1.42185287e+00 4.75013901e+01
1716.lowfreq: -18.5840 -7.6380 -5.5550 0.0006 0.0007 0.0009 20.4965 78.0781 115.6390
frequency: 18.6834 78.0091 115.6347 229.1527 304.7427 326.6595 373.0613 632.6355 694.7540 717.8792 737.5475 776.3115 858.6054 890.7487 920.0681 952.8493 1007.9396 1042.9839 1055.6568 1095.7972 1096.6141 1148.0138 1199.6136 1264.3566 1281.2303 1301.9191 1339.9087 1391.1720 1401.5716 1447.1298 1468.0281 1475.4924 1478.2358 1485.3561 2976.4685 2991.0247 3010.0212 3038.5591 3069.0709 3078.5882 3084.5663 3607.5912
redmass: 2.8512 2.1867 4.2315 1.0929 2.9414 2.8925 5.3665 6.2627 4.7863 1.2479 1.1494 5.4939 1.3100 2.0184 5.3088 9.3271 9.9585 1.9133 2.5075 2.1957 5.9392 7.6394 2.0965 1.4522 1.3013 1.2059 1.4257 1.2130 1.5871 1.4601 2.3927 1.1135 1.0479 1.0984 1.0357 1.0604 1.0599 1.1005 1.1012 1.0990 1.1032 1.0845
irintensity: 2.4006 0.3203 1.1539 0.0041 0.9629 6.2824 6.2579 16.5669 6.6500 115.0009 5.1016 4.0933 2.5422 6.2243 8.6496 14.7542 0.4775 3.1298 0.8907 15.6513 18.1423 0.7415 6.6220 5.3100 0.6595 4.7094 1.6981 10.5757 8.4410 15.3905 27.5387 11.1229 13.4643 19.4427 35.2472 11.5795 30.8342 0.4065 11.4315 42.9806 62.5590 96.1418
temp: 298.150 k
press: 1.00000 atm
elementType: 7 7 7 7 6 6 6 6 1 1 1 1 1 1 1 1
symmnumber: 1
zpe: 337731.2 jmol-1
zpe.correction: 0.128635 hartree
zpe.thermalcorrener: 0.136541 hartree
zpe.thermalcorrenthalpy: 0.137485 hartree
zpe.thermalcorrgfe: 0.094456 hartree
zpe.sumelectzpe: -375.560388 hartree
zpe.sumelectthermal: -375.552482 hartree
zpe.sumelectthermalent: -375.551538 hartree
zpe.sumelectthermalfe: -375.594567 hartree
dipole: 0.3193 -2.2012 -0.3861
dipole: 2.2575
quadrupole: -39.5865 -54.4922 -47.1497
quadrupole: 6.8242 2.3613 0.2491
quadrupole: 7.4896 -7.4160 -0.0736 6.8242 2.3613 0.2491
hfenergy: -375.6890232 hartree
pointgroup: C01 [X(C4H8N4)]
dipole: -0.1510236 -0.8713774 -0.0819663 debye
dipolederiv: -0.0819184 -0.2230746 -0.0254866 0.1274587 -0.3382017 -0.0215178 0.0347687 -0.1077192 -0.1288737 -0.4269757 0.2129758 -0.0309399 -0.1000776 -0.1517285 -0.0095045 -0.0922203 0.0715127 -0.1699917 -0.3625878 0.2826819 0.0418774 0.2006277 -0.1118479 0.0825119 -0.030882 0.0928613 -0.1523614 -0.1042337 -0.253468 -0.0164615 -0.2578613 0.2034772 -0.0333533 -0.0389548 -0.0151574 -0.1212205 -0.1581725 0.0171004 0.0191037 0.0361856 0.1468506 -0.0068316 0.1375642 -0.0131112 0.0889926 0.0969554 -0.0033192 -0.0418038 -0.0198685 0.1531011 -0.0141656 -0.1716645 -0.0093044 0.0900266 0.6763298 -0.0108435 0.1165196 0.0537985 0.0207198 0.0043084 0.2078896 -0.006204 0.0280039 -0.0828253 0.0056551 -0.0065882 0.0122325 0.1046577 0.0005755 0.0665545 -0.0021933 0.0578457 0.0399448 0.0162228 -0.0269154 0.0233413 -0.016816 0.1223736 -0.0296501 0.0743059 0.0003404 0.04235 -0.0111611 -0.01156 -0.0407929 -0.0468067 -0.1135718 -0.0203835 -0.0668011 0.0265512 0.0201897 0.0547149 -0.0241769 0.0384984 -0.0572063 0.1357119 -0.0098836 0.0981633 -0.0354188 0.0288486 -0.0604069 -0.027351 -0.0468324 -0.0608729 -0.1144024 -0.0223753 -0.0794788 0.0066134 0.0604238 0.0054441 -0.0182737 0.0529386 -0.069066 0.1309677 -0.0691192 0.1287718 -0.0108773 0.0506349 -0.0195521 -0.0263813 -0.0771941 -0.0982125 -0.1172633 -0.0726724 -0.110859 0.0233165 -0.0852986 0.0147808 0.1133848 0.0196116 0.101911 -0.016884 0.1444936 -0.0176225 -0.0666362 0.2863354 -0.0277504 -0.0349471 -0.0220661 0.2200411 -0.0289546 -0.0334648 -0.0371641 0.3636893 unknown
polarizability: 89.4562195|-3.2129741|63.8296803|5.5763861|2.7715584|48.0477749 unknown
InChI: InChI=1S/C4H8N4/c1-2-3-4-5-7-8-6-4/h7H,2-3H2,1H3
charge 0 multiplicity 1
16 atoms
N  1.099804 -1.179998 -0.24412
N  0.992271 1.088566 0.112112
N  2.285563 -0.648988 0.191596
N  2.26157 0.720408 0.416412
C  -1.142099 -0.074588 -0.677324
C  -2.095097 0.04633 0.545524
C  0.302374 -0.064592 -0.285268
C  -3.576413 0.076239 0.116512
H  -1.333065 0.771443 -1.36339
H  -1.355888 -1.008555 -1.227067
H  -1.915582 -0.805406 1.22967
H  -1.842038 0.966168 1.105883
H  -3.779863 0.935125 -0.550349
H  -3.855225 -0.84643 -0.426354
H  -4.242302 0.165661 0.993729
H  3.12259 -1.21318 0.333633
