program: Gaussian 09
title: 000223418
version: EM64L-G09RevD.01
frameworkgroup: C1[X(C7H13NO2)]
method: RPBEPBE
basis: SDD
operation: Freq
keyword: #p
keyword: freq=noraman
keyword: PBEPBE/SDD
title: #p freq=noraman PBEPBE/SDD
converged: YES YES NO NO
title: Mulliken charges:
elementType: O O N C C C C C C C H H H H H H H H H H H H H
charge: -0.459895 -0.294952 -0.360929 -0.136952 -0.440196 0.194619 0.478970 -0.665156 -0.801245 -0.715736 0.218707 0.270897 0.220402 0.309933 0.252672 0.234343 0.183099 0.224503 0.230254 0.234283 0.367782 0.228913 0.225684
chargesum: 0.00000
title: Mulliken charges with hydrogens summed into heavy atoms:
elementType: O O N C C C C C C C
charge: -0.092113 -0.294952 -0.050996 0.081755 0.051103 0.194619 0.478970 0.004958 -0.112204 -0.261139
polarizability: 1.07886309e+02 -2.47337498e+00 9.19932156e+01 4.18763682e+00 7.05110390e-03 6.68776897e+01
1716.lowfreq: -15.1306 -4.5037 -0.0007 -0.0006 0.0002 3.5376 27.5874 46.5073 59.4068
frequency: 26.3113 46.2364 59.3313 65.4953 164.4035 201.9205 215.5779 235.5379 280.8889 319.0620 350.5505 402.9989 418.9274 445.2787 487.9912 539.2886 599.6060 627.6418 691.2431 714.5506 809.3240 855.6768 896.7327 940.2107 949.1420 984.8606 999.8621 1020.8815 1056.4566 1071.8504 1083.1766 1125.9146 1219.5475 1237.0989 1243.6365 1263.7579 1315.8087 1360.6105 1381.2790 1386.6707 1396.3695 1420.1542 1455.3992 1459.0654 1463.8213 1473.8736 1474.9911 1509.2737 1611.7047 1678.8101 2960.2435 2967.5629 2967.8427 2983.2341 3030.6209 3039.0136 3080.8295 3095.8443 3098.8904 3106.2029 3201.3149 3378.7877 3544.4712
redmass: 3.5317 3.4212 4.1102 4.1301 1.0524 2.1283 2.1754 1.4535 4.1473 3.4178 5.2955 2.8863 2.1937 2.1851 1.1907 2.3361 1.5836 2.9602 1.0669 3.5748 3.2373 2.8719 2.3163 1.3523 1.8887 1.5597 1.4494 1.9154 2.3817 2.1618 2.8480 2.1689 1.3989 1.2551 1.7317 1.9069 1.2343 1.6139 1.3499 1.2215 1.2031 1.1854 1.0724 1.0700 1.0519 1.0653 1.0639 1.9502 6.6910 5.1059 1.0627 1.0411 1.0825 1.0382 1.0939 1.0966 1.0972 1.0969 1.0632 1.1009 1.1140 1.0642 1.0771
irintensity: 2.9238 0.1994 0.2706 2.3841 0.3313 0.6403 1.9929 0.7870 1.6825 3.1493 41.3551 22.2397 9.6813 21.5241 82.7864 16.6062 103.7546 7.3828 1.1949 6.8916 7.1973 7.7816 2.8150 64.8409 9.7901 0.3704 2.0571 57.5035 40.5043 5.1201 33.5062 48.1584 1.3034 1.8846 126.6004 40.6199 2.4958 16.5872 144.7894 22.3910 18.4734 1.4650 18.2195 18.7657 8.0085 33.9048 11.6729 142.7672 165.2602 13.9525 25.8271 50.4369 39.5474 24.1391 4.2571 24.3734 39.2348 25.4764 2.7897 22.6884 22.2090 61.5382 19.4715
temp: 298.150 k
press: 1.00000 atm
elementType: 8 8 7 6 6 6 6 6 6 6 1 1 1 1 1 1 1 1 1 1 1 1 1
symmnumber: 1
zpe: 505384.3 jmol-1
zpe.correction: 0.192491 hartree
zpe.thermalcorrener: 0.204563 hartree
zpe.thermalcorrenthalpy: 0.205507 hartree
zpe.thermalcorrgfe: 0.153099 hartree
zpe.sumelectzpe: -478.928659 hartree
zpe.sumelectthermal: -478.916587 hartree
zpe.sumelectthermalent: -478.915643 hartree
zpe.sumelectthermalfe: -478.968051 hartree
dipole: 4.1170 1.9967 2.2600
dipole: 5.1034
quadrupole: -68.0997 -62.0863 -60.6775
quadrupole: -5.3017 -0.5796 -1.0790
quadrupole: -4.4785 1.5349 2.9437 -5.3017 -0.5796 -1.0790
hfenergy: -479.12115 hartree
pointgroup: C01 [X(C7H13N1O2)]
dipole: 1.4281084 1.3980573 -0.193251 debye
dipolederiv: -0.5887477 -0.262714 0.1138499 -0.1242625 -0.5361942 0.0762134 0.0399718 0.0403618 -0.5925364 -0.7003844 0.0433059 -0.0658481 -0.3576802 -0.9712461 0.197648 0.0344053 0.1802238 -0.399823 -1.1255104 -0.406018 0.060267 -0.3593207 -0.5026398 -0.0167141 0.0860673 -0.0630071 -0.4268836 0.1539119 0.1952722 -0.1548599 0.2594675 0.4326177 0.0221076 -0.1957977 0.0016556 0.4124715 0.4723416 0.0566863 0.0073817 -0.2306873 0.0574248 0.1490966 0.1395838 0.1253351 0.2217199 1.1346416 0.2638612 0.1483246 0.6563782 1.1874416 -0.2624079 0.0213236 -0.2158362 0.1950248 0.2996605 0.0239747 0.0091321 0.0595477 -0.0349594 -0.1400982 -0.0253297 -0.1171174 0.2479663 -0.0458197 0.0269973 -0.0297999 0.0215102 0.0536818 0.0336404 0.0612318 0.0603737 -0.1218463 -0.1635114 -0.0080099 -0.0219895 -0.0160353 0.0802996 0.0209663 -0.0099666 0.026425 -0.0031797 -0.0535733 0.0430563 -0.0682394 0.0526308 -0.4273935 -0.0006985 -0.0213161 -0.0204109 -0.2489505 0.0097656 -0.009139 0.011065 -0.010486 -0.1359874 -0.0870855 0.0045388 -0.1052383 -0.0475744 0.11331 -0.0098337 0.0423669 0.0806668 0.0151359 0.0359547 -0.009657 0.0185893 0.0756192 -0.0721919 -0.0636547 -0.0504088 -0.0144921 0.0577473 -0.1280115 -0.0902565 -0.0807521 -0.0967342 0.1623715 0.0074326 -0.0270972 0.0388751 0.1414101 0.0623591 -0.0905352 0.0782471 0.2851233 -0.1050555 0.064198 -0.0792067 0.057035 0.0942167 0.0219122 -0.0701527 0.0277298 0.0597518 0.0966154 0.0604963 0.0589856 0.0580953 -0.0391908 -0.1025262 0.0394931 -0.0522921 0.0029394 0.0039955 -0.1493091 0.0422271 -0.15677 -0.0851026 0.0421844 0.0194051 0.016716 0.0458213 0.0566295 0.0105394 -0.0370748 -0.045024 -0.0058888 -0.135498 -0.065151 -0.1232695 -0.0392708 0.0654995 0.0079289 -0.044299 0.0650216 -0.0846143 0.1076862 -0.0435374 0.0969352 0.0578118 -0.0457318 -0.0181601 0.0668391 -0.035372 0.1054274 0.0308538 0.1499899 0.0301558 -0.0395285 0.4750415 0.1615079 -0.0230141 0.0347358 0.242725 0.0176522 0.0251343 0.0291685 0.3245324 -0.0952804 0.002404 -0.0718223 -0.0077305 0.1775847 0.013704 -0.0932942 0.0031364 0.0808238 -0.0479777 -0.0408223 0.1132207 -0.0261034 0.1775043 0.0410608 0.0938494 0.0428704 0.006722 unknown
polarizability: 106.6857647|6.8017759|75.6692779|5.7075477|-10.7944784|84.4021717 unknown
InChI: InChI=1S/C7H13NO2/c1-5(2)4-8-7(10)6(3)9/h6,8-9H,1,4H2,2-3H3
charge 0 multiplicity 1
23 atoms
O  -3.443453 -0.767256 0.538955
O  -0.936612 -1.473852 1.058623
N  -0.028901 0.642065 0.680541
C  -2.459776 0.270554 0.272778
C  1.350593 0.28184 1.029783
C  -1.068324 -0.256006 0.707209
C  2.378581 0.568076 -0.063042
C  -2.490786 0.657171 -1.223545
C  3.818681 0.508664 0.410746
C  2.034631 0.834928 -1.349342
H  -2.716804 1.155338 0.891815
H  1.33768 -0.79877 1.27041
H  1.653179 0.809801 1.958588
H  -0.211334 1.602771 0.383623
H  -3.529389 0.902099 -1.501904
H  -2.156634 -0.189131 -1.848507
H  -1.856179 1.537802 -1.441457
H  4.018923 1.275974 1.184501
H  4.044925 -0.473904 0.869843
H  4.525232 0.66625 -0.420707
H  -2.922326 -1.578071 0.814723
H  0.989573 0.846986 -1.678516
H  2.796518 1.023872 -2.113217
