program: Gaussian 09
title: 000223413
version: EM64L-G09RevD.01
frameworkgroup: C1[X(C4H7NO2)]
method: RPBEPBE
basis: SDD
operation: Freq
keyword: #pfreq=noraman
keyword: PBEPBE/SDD
title: #p freq=noraman PBEPBE/SDD
converged: NO YES NO NO
title: Mulliken charges:
elementType: O O N C C C C H H H H H H H
charge: -0.271292 -0.240478 -0.392525 -0.104529 -0.223451 0.166444 -0.666602 0.250148 0.219834 0.232330 0.334388 0.238529 0.220825 0.236378
chargesum: 0.00000
title: Mulliken charges with hydrogens summed into heavy atoms:
elementType: O O N C C C C
charge: -0.271292 -0.240478 -0.058137 0.145619 0.228713 0.166444 0.029130
polarizability: 6.63389868e+01 1.23964400e+00 5.31396950e+01 -4.11719257e+00 6.25962685e-01 4.00671047e+01
1716.lowfreq: -14.4269 -9.5583 -0.0008 -0.0002 0.0005 11.2772 53.9391 164.5995 217.0532
frequency: 53.9107 164.5945 217.0511 230.7240 364.2186 444.2001 534.5381 620.5256 682.1683 723.1222 782.9239 814.5226 944.5651 1032.9676 1054.1929 1057.3908 1070.0133 1102.8491 1143.7653 1243.7375 1278.6612 1314.6269 1324.4866 1380.2457 1403.1774 1462.5155 1472.5410 1509.9442 1673.0416 2949.5622 2993.1892 3024.7957 3037.0121 3095.7212 3105.1572 3586.2141
redmass: 3.3909 3.1254 1.0663 2.9223 3.3536 4.4379 1.2818 6.0550 4.7930 7.4382 2.9097 2.8043 4.2812 2.1455 1.8041 2.5541 1.5959 2.0350 1.1179 1.6340 2.4552 1.2449 1.5185 1.2267 1.7155 1.0516 1.0502 1.0863 8.5738 1.0640 1.0348 1.1013 1.0872 1.1000 1.1010 1.0792
irintensity: 16.7792 0.7835 1.3530 2.0261 0.5323 19.0093 128.0518 14.9511 24.8304 9.8434 7.2635 2.8041 11.1617 52.8886 30.0431 23.1835 5.9130 1.8731 7.0278 48.5339 70.2532 4.1957 22.4939 14.8300 36.5687 14.7620 6.1231 3.1866 348.0856 111.0372 13.3042 49.0120 16.9706 26.8357 19.7445 41.9588
temp: 298.150 k
press: 1.00000 atm
elementType: 8 8 7 6 6 6 6 1 1 1 1 1 1 1
symmnumber: 1
zpe: 292444.3 jmol-1
zpe.correction: 0.111386 hartree
zpe.thermalcorrener: 0.118349 hartree
zpe.thermalcorrenthalpy: 0.119293 hartree
zpe.thermalcorrgfe: 0.080025 hartree
zpe.sumelectzpe: -361.263709 hartree
zpe.sumelectthermal: -361.256746 hartree
zpe.sumelectthermalent: -361.255802 hartree
zpe.sumelectthermalfe: -361.295070 hartree
dipole: -2.7152 -0.7542 1.2394
dipole: 3.0785
quadrupole: -38.2901 -47.0601 -40.5785
quadrupole: -9.5176 -2.3893 0.3151
quadrupole: 3.6861 -5.0839 1.3977 -9.5176 -2.3893 0.3151
hfenergy: -361.3750949 hartree
pointgroup: C01 [X(C4H7N1O2)]
dipole: -1.0833707 0.2388279 -0.4860604 debye
dipolederiv: -0.8292281 -0.1652741 -0.0438431 -0.0104687 -0.4641055 -0.007812 -0.063133 0.0091044 -0.383652 -0.9052629 0.2545459 -0.0961465 0.4329076 -0.7816683 0.0467818 -0.0318075 -0.0359075 -0.36812 -1.1549896 0.2364254 -0.0949301 -0.1018079 -0.5013737 0.0187226 -0.1658454 0.0710069 -0.5330818 0.6732597 0.0818958 -0.0214676 -0.0753709 -0.0654852 -0.1158162 -0.0280269 -0.1210955 0.3449855 0.7387017 -0.0800567 0.0713901 -0.0720976 0.6915357 -0.0408432 0.0882245 -0.0272321 0.5873682 1.5426412 -0.365592 0.2748619 -0.1860617 0.8562352 0.0457742 0.2936782 0.1093134 0.230246 -0.0956949 0.0045955 0.0731023 -0.0608634 -0.0057559 0.0612916 0.0874539 0.0152244 -0.0220974 -0.0195153 -0.004412 -0.04805 -0.0010813 0.0696573 0.0064175 -0.0621138 0.0027145 -0.1012959 -0.0250252 0.0181409 -0.0537921 0.0641163 -0.0227733 0.0479927 -0.1586599 0.0549244 -0.1861421 -0.176399 -0.0108288 0.0661809 -0.0390016 0.0319608 0.0318566 0.1210357 0.0084876 0.0144199 0.186359 0.0221471 -0.040834 0.0461058 0.1588659 -0.0426284 -0.0459764 -0.0658053 0.3600567 -0.0892332 0.0445671 -0.0018681 0.0795609 0.0789483 0.0140886 -0.0052274 0.0205228 0.0998204 0.0552943 -0.01496 -0.0953823 -0.0321452 0.0870598 -0.0272935 -0.0459832 0.0063802 -0.1139867 0.0990923 -0.0211941 0.0107785 -0.0437924 -0.1331011 -0.0385323 0.0163813 -0.0476381 0.0714792 unknown
polarizability: 66.449407|-0.527104|53.050708|4.0255147|0.8057746|40.0456715 unknown
InChI: InChI=1S/C4H7NO2/c1-3-4(6)5-2-7-3/h3,5H,2H2,1H3
charge 0 multiplicity 1
14 atoms
O  -0.898036 1.152964 0.581598
O  1.317397 -1.702158 0.247846
N  -0.930772 -1.056267 -0.134862
C  0.500448 0.648136 0.597305
C  -1.752626 0.15753 -0.09012
C  0.391102 -0.849823 0.233547
C  1.407526 1.417694 -0.376029
H  0.867458 0.749869 1.634101
H  -2.022759 0.509557 -1.108126
H  -2.669034 0.02543 0.514559
H  -1.277007 -1.967824 -0.43333
H  2.430362 1.002993 -0.32899
H  1.041356 1.330782 -1.414227
H  1.439285 2.485417 -0.101773
