program: Gaussian 09
title: 000223404
version: EM64L-G09RevD.01
frameworkgroup: C1[X(C20H22O2)]
method: RPBEPBE
basis: SDD
operation: Freq
keyword: #pfreq=noraman
keyword: PBEPBE/SDD
title: #p freq=noraman PBEPBE/SDD
converged: YES YES NO NO
title: Mulliken charges:
elementType: O O C C C C C C C C C C C C C C C C C C C C H H H H H H H H H H H H H H H H H H H H H H
charge: -0.228889 -0.228991 -0.383510 -0.382954 -0.539494 -0.539346 0.110898 0.110688 0.308743 0.309589 -0.343878 -0.345434 -0.357683 -0.356682 0.443900 0.443243 -0.419725 -0.408158 -0.372639 -0.382911 -0.804887 -0.804816 0.243701 0.214071 0.244010 0.213498 0.233440 0.217089 0.216424 0.233724 0.240040 0.239355 0.275132 0.275103 0.233939 0.233689 0.232894 0.233154 0.227949 0.229428 0.239465 0.228310 0.240162 0.228360
chargesum: 0.00000
title: Mulliken charges with hydrogens summed into heavy atoms:
elementType: O O C C C C C C C C C C C C C C C C C C C C
charge: -0.228889 -0.228991 0.074262 0.074554 -0.088964 -0.089199 0.110898 0.110688 0.308743 0.309589 -0.103837 -0.106079 -0.082551 -0.081580 0.443900 0.443243 -0.185787 -0.174468 -0.139745 -0.149757 -0.108045 -0.107984
polarizability: 1.61150358e+02 1.47465875e+00 2.74253557e+02 2.31703061e+01 -2.87013454e-01 2.14115418e+02
1716.lowfreq: -28.5775 -5.6167 -0.0005 -0.0005 0.0003 4.2706 7.3830 8.9021 14.5055
frequency: -28.4972 7.6999 14.3316 23.3663 27.6189 43.2637 53.1792 66.2001 96.9312 98.5331 113.5720 153.3396 158.1368 212.9524 215.7538 248.6321 262.7932 290.1054 341.0122 342.2891 349.9014 351.5760 405.0652 406.3645 427.9792 460.1229 462.3310 482.4354 494.3456 539.2149 541.4990 633.7548 633.9176 650.1007 650.5985 678.9483 684.1177 730.3315 740.3787 786.8707 797.3788 800.8543 819.4358 832.0909 845.4789 860.8909 863.1826 911.9423 922.4783 966.0369 966.8314 980.6824 987.8828 994.9696 999.4001 999.9354 1009.0154 1011.4829 1020.9393 1031.1160 1046.4927 1046.9452 1080.4448 1085.4808 1122.5742 1123.4866 1142.6575 1145.8265 1190.7999 1192.8193 1213.5191 1224.5259 1224.6422 1256.7493 1283.2962 1283.9167 1305.4052 1306.5437 1314.0373 1320.5867 1326.1720 1367.6934 1371.9741 1375.1107 1396.4371 1397.0740 1410.2514 1410.8148 1461.1765 1465.3823 1465.8973 1468.3023 1468.5703 1472.6100 1472.7041 1474.5809 1501.6749 1501.7162 1555.6463 1556.4906 1588.4303 1589.1958 1620.5923 1620.9938 2976.1865 2976.5127 2984.7604 2990.6735 3004.0211 3004.2705 3034.3202 3056.8104 3057.6022 3057.9669 3070.3800 3073.9914 3088.2901 3089.0965 3123.2669 3124.0111 3126.0168 3126.5390 3153.1741 3153.3361 3157.9535 3158.0979
redmass: 1.0129 4.9066 4.9314 5.4203 1.0481 3.7302 4.0244 6.0349 5.3635 4.8309 2.9529 3.1357 3.9101 3.0237 3.6048 3.6520 4.3456 3.5420 2.9394 3.0195 3.6984 3.6033 2.8908 2.8465 3.4640 3.1746 2.9255 2.8422 2.8642 4.4034 4.2194 6.8749 6.8815 3.3955 4.1447 2.5075 3.4330 2.3443 2.6422 2.3310 4.9403 2.1293 2.1795 1.4696 1.6624 1.2811 1.4114 1.8487 2.4263 1.3559 1.3771 1.8594 1.4238 1.7883 1.3708 1.4384 3.1669 2.6000 2.9493 2.2471 1.5929 1.5901 2.3682 2.9833 1.3003 1.3081 1.2769 1.3989 1.1264 1.1236 1.3761 2.9944 2.9648 2.0559 2.6789 1.5515 1.2921 1.3015 1.3484 1.1715 1.4070 2.0933 4.6607 2.4582 1.2225 1.2285 3.6701 3.6541 1.0788 1.1139 1.1271 1.1057 1.0957 1.0580 1.0674 1.0986 2.5526 2.5608 6.8179 6.6712 7.3193 7.4157 6.4642 6.4619 1.0389 1.0388 1.0604 1.0613 1.0606 1.0604 1.0985 1.1036 1.0948 1.0944 1.1015 1.1019 1.1000 1.0998 1.0890 1.0888 1.0886 1.0884 1.0945 1.0944 1.0959 1.0959
irintensity: 0.5563 0.8105 0.5337 3.4432 0.3140 0.3185 0.2881 0.0471 2.3209 0.0968 5.6495 2.1441 1.9201 1.7729 4.0379 2.2936 0.0396 0.8059 1.4335 3.2436 0.2633 0.0025 0.0023 0.0729 0.0114 2.8463 0.0296 32.8680 0.8358 22.5866 2.0338 0.5725 0.6315 0.1817 0.8719 4.8617 12.0002 4.7513 23.5076 11.1144 0.1025 0.2603 11.7678 80.6584 3.6619 17.1569 3.1218 0.2380 11.8304 1.4096 2.2618 20.1812 0.3101 34.9461 4.0088 1.6059 8.8863 0.0055 16.3725 0.0663 20.2614 18.1540 0.5836 0.2188 7.8950 14.9964 34.1586 55.7174 14.8460 22.2781 1.0448 0.3104 1.3219 47.4267 243.1268 21.5173 1.8909 10.6718 13.3740 4.2795 22.1828 0.0376 5.2755 9.9900 11.7143 18.7216 7.5240 13.7457 7.2329 24.5012 12.9423 14.8163 13.9309 14.3298 8.8370 9.1591 0.4589 0.9927 59.5196 158.4771 24.9765 120.2278 25.9094 56.2734 22.6025 27.3003 2.2120 34.2022 32.6295 18.7894 1.6275 24.4088 24.9846 18.6804 25.4980 68.5527 15.2594 16.0405 13.0817 12.0795 15.2191 15.5201 17.6869 19.1757 1.7728 1.6871
temp: 298.150 k
press: 1.00000 atm
elementType: 8 8 6 6 6 6 6 6 6 6 6 6 6 6 6 6 6 6 6 6 6 6 1 1 1 1 1 1 1 1 1 1 1 1 1 1 1 1 1 1 1 1 1 1
symmnumber: 1
zpe: 953059.5 jmol-1
zpe.correction: 0.363001 hartree
zpe.thermalcorrener: 0.384146 hartree
zpe.thermalcorrenthalpy: 0.385090 hartree
zpe.thermalcorrgfe: 0.307777 hartree
zpe.sumelectzpe: -924.192677 hartree
zpe.sumelectthermal: -924.171532 hartree
zpe.sumelectthermalent: -924.170588 hartree
zpe.sumelectthermalfe: -924.247901 hartree
dipole: 0.0375 3.2180 -0.0256
dipole: 3.2183
quadrupole: -125.3250 -112.4360 -139.6449
quadrupole: 0.2203 17.7320 -0.1217
quadrupole: 0.4770 13.3660 -13.8429 0.2203 17.7320 -0.1217
hfenergy: -924.5556778 hartree
pointgroup: C01 [X(C20H22O2)]
dipole: -0.5185948 -1.1550847 0.0069109 debye
polarizability: 174.4568723|44.8680314|254.1037251|-10.239006|4.7687781|220.9587359 unknown
InChI: InChI=1S/C20H22O2/c1-15-7-11-17(12-8-15)19(21)5-3-4-6-20(22)18-13-9-16(2)10-14-18/h7-14H,3-6H2,1-2H3
charge 0 multiplicity 1
44 atoms
O  2.870962 0.526997 1.976107
O  -1.488669 2.539949 -1.966654
C  1.608081 2.335838 -0.580337
C  0.69901 2.761521 0.594066
C  2.981316 1.7676 -0.107169
C  -0.629427 3.428831 0.121615
C  2.831337 0.481726 0.707222
C  -1.500132 2.475392 -0.698026
C  2.596777 -0.822486 -0.000626
C  -2.33012 1.438155 0.003574
C  2.572407 -0.943416 -1.416086
C  -2.424125 1.346465 1.418663
C  2.394676 -1.992875 0.782635
C  -3.060622 0.506838 -0.785194
C  2.146259 -3.364018 -1.246124
C  -3.949043 -0.580116 1.236414
C  2.351903 -2.196119 -2.025028
C  -3.223404 0.353654 2.021198
C  2.175873 -3.238819 0.170514
C  -3.855329 -0.481807 -0.179108
C  1.879936 -4.70565 -1.902598
C  -4.780718 -1.667755 1.889807
H  1.087444 1.593495 -1.213606
H  1.800647 3.214364 -1.226919
H  0.47819 1.889951 1.238321
H  1.243216 3.487421 1.229606
H  3.477287 2.510106 0.543536
H  3.627593 1.601028 -0.988918
H  -1.179429 3.804531 1.004378
H  -0.393224 4.292662 -0.525436
H  2.729887 -0.065073 -2.050504
H  -1.881017 2.05069 2.057324
H  2.420877 -1.889824 1.87274
H  -2.986252 0.589899 -1.874778
H  2.338247 -2.271233 -3.11882
H  -3.286591 0.299383 3.114604
H  2.026955 -4.131306 0.790597
H  -4.414698 -1.188907 -0.803703
H  2.233199 -4.724521 -2.947861
H  2.37354 -5.52906 -1.356252
H  0.795039 -4.928268 -1.915903
H  -5.655062 -1.937551 1.271802
H  -4.181796 -2.589032 2.029717
H  -5.143599 -1.358859 2.885504
