program: Gaussian 09
title: 000223403
version: EM64L-G09RevD.01
frameworkgroup: C1[X(C19H15NO2)]
method: RPBEPBE
basis: SDD
operation: Freq
keyword: #p
keyword: freq=noraman
keyword: PBEPBE/SDD
title: #p freq=noraman PBEPBE/SDD
converged: YES YES NO NO
title: Mulliken charges:
elementType: O O N C C C C C C C C C C C C C C C C C C C H H H H H H H H H H H H H H H
charge: -0.210955 -0.210553 0.025782 -0.491884 0.448347 0.454153 0.442521 -0.381944 -0.346968 -0.418332 -0.419165 -0.386226 -0.382619 -0.372559 -0.378361 0.375388 -0.231468 -0.232072 -0.235535 -0.237765 -0.242208 -0.241237 0.225599 0.250683 0.269208 0.236970 0.235752 0.250393 0.257704 0.285334 0.285045 0.228223 0.228609 0.229054 0.228642 0.231280 0.231162
chargesum: 0.00000
title: Mulliken charges with hydrogens summed into heavy atoms:
elementType: O O N C C C C C C C C C C C C C C C C C C C
charge: -0.210955 -0.210553 0.025782 -0.266285 0.448347 0.454153 0.442521 -0.131261 -0.077760 -0.181362 -0.183413 -0.135833 -0.124916 -0.087225 -0.093316 0.375388 -0.003244 -0.003463 -0.006480 -0.009123 -0.010927 -0.010074
polarizability: 2.67067043e+02 2.88316836e-01 2.21226367e+02 -2.37994739e+00 5.91358962e+00 1.71448013e+02
1716.lowfreq: -16.1196 -5.8215 -0.0004 0.0003 0.0004 4.1076 17.7745 24.3329 35.4376
frequency: 16.9754 23.9934 35.0622 41.2930 55.2204 66.6040 69.1936 127.5463 169.7569 217.2647 227.2736 238.1376 277.4881 290.9804 319.3379 401.7686 403.7486 407.9179 409.5525 467.9580 490.9969 506.0883 514.6658 600.3063 612.7785 616.2522 622.4134 633.8381 663.6743 677.0354 706.0850 706.9693 726.1108 751.9108 760.4655 787.4641 813.8572 848.1672 854.9705 855.4851 858.6049 859.3127 886.3874 928.9478 932.8080 979.6449 981.3453 989.6003 990.8005 991.2059 997.9195 998.4212 1001.5291 1006.3879 1025.7825 1027.9275 1080.7609 1085.3564 1094.0171 1112.0366 1165.1763 1173.1693 1173.3216 1183.1163 1190.7858 1192.3779 1199.8894 1202.3317 1223.1204 1261.8934 1269.0286 1304.8129 1328.7459 1337.6422 1362.7936 1376.8655 1384.6882 1401.9704 1416.6856 1437.9770 1441.7448 1478.8376 1480.5585 1482.1151 1589.4584 1593.2336 1594.9258 1604.3824 1609.0505 1613.4129 2975.8160 3114.1783 3117.5043 3125.3621 3126.4013 3136.7147 3137.4161 3138.2976 3147.6178 3148.6169 3155.4022 3164.3519 3164.6963 3181.0974 3183.5530
redmass: 5.0061 3.9515 6.4221 4.0657 5.6155 5.7789 6.0682 6.5119 6.9766 5.3783 5.1768 4.9626 5.3588 5.2007 5.3632 2.8201 2.8319 3.5886 4.4926 3.7861 3.7586 7.1535 3.7652 5.2408 6.2937 6.0768 6.4440 6.1116 5.6226 4.8005 1.7441 1.8523 3.5642 2.4736 2.1736 5.2061 2.8770 2.3672 1.3814 1.3573 2.7096 1.3284 2.1107 1.4902 1.4978 1.3935 1.4080 1.3634 5.6049 5.9355 1.3170 1.3249 1.3580 3.0864 2.3197 2.1934 1.6387 1.6054 3.2945 1.3210 3.1415 1.0551 1.0590 1.3459 1.1161 1.1194 2.3926 2.2439 5.2937 1.6397 1.5770 1.3253 1.3659 1.2692 6.1597 8.1180 6.8238 7.4455 3.3132 2.1877 2.1475 2.3861 2.2204 2.2451 6.3285 6.0583 7.2858 6.1778 5.9772 6.0638 1.0823 1.0879 1.0872 1.0862 1.0859 1.0905 1.0913 1.0911 1.0959 1.0957 1.0896 1.1015 1.1014 1.0946 1.0956
irintensity: 0.0712 0.0020 0.7528 0.0270 0.3640 0.1522 0.0394 1.8833 3.3858 0.7180 0.2136 0.4519 1.2661 0.1955 0.9021 0.3597 0.2077 1.2883 0.7348 4.4934 5.8119 0.6541 19.1938 10.6893 0.0151 1.8766 3.0917 5.2137 9.8726 24.3588 55.8545 36.9974 26.9712 29.9248 64.7003 4.5067 16.0913 11.4245 0.6653 0.2148 1.2616 0.2086 28.0090 2.4901 2.4453 0.0476 0.0306 2.1021 1.6577 2.2760 0.0772 0.1870 0.4660 7.3150 6.5059 11.2622 1.1626 12.8143 17.3846 15.9819 0.2005 0.0438 0.0681 72.3715 1.8589 4.2918 0.0656 1.0700 361.5071 0.9153 0.5601 1.4565 0.1492 1.1126 81.6017 10.9005 0.3383 4.8244 48.1779 9.9914 4.3420 8.3717 22.3327 22.9164 3.5331 1.7192 0.5224 87.6818 12.8560 1.1295 11.1336 8.2254 6.3212 0.7899 0.1307 7.6416 10.5878 12.8750 29.8987 33.8817 1.8071 36.2717 17.3276 0.0087 2.6783
temp: 298.150 k
press: 1.00000 atm
elementType: 8 8 7 6 6 6 6 6 6 6 6 6 6 6 6 6 6 6 6 6 6 6 1 1 1 1 1 1 1 1 1 1 1 1 1 1 1
symmnumber: 1
zpe: 753267.8 jmol-1
zpe.correction: 0.286905 hartree
zpe.thermalcorrener: 0.304880 hartree
zpe.thermalcorrenthalpy: 0.305824 hartree
zpe.thermalcorrgfe: 0.237194 hartree
zpe.sumelectzpe: -936.626723 hartree
zpe.sumelectthermal: -936.608747 hartree
zpe.sumelectthermalent: -936.607803 hartree
zpe.sumelectthermalfe: -936.676434 hartree
dipole: 6.1666 -0.0246 -0.9089
dipole: 6.2332
quadrupole: -161.3280 -117.0885 -119.2632
quadrupole: -0.2091 3.9794 -1.7106
quadrupole: -28.7681 15.4714 13.2967 -0.2091 3.9794 -1.7106
hfenergy: -936.9136272 hartree
pointgroup: C01 [X(C19H15N1O2)]
dipole: -2.4206998 0.0765626 0.3851381 debye
polarizability: 266.9268053|-1.8989117|220.9777325|-3.675656|-7.0193404|171.8368852 unknown
InChI: InChI=1S/C19H15NO2/c21-20(22)18-13-11-17(12-14-18)19(15-7-3-1-4-8-15)16-9-5-2-6-10-16/h1-14,19H
charge 0 multiplicity 1
37 atoms
O  5.583877 -0.902089 0.43193
O  5.308148 0.573602 -1.285404
N  4.849346 -0.143184 -0.313031
C  -0.875857 0.021447 0.814454
C  0.62887 0.010575 0.496582
C  -1.582834 -1.261979 0.339697
C  -1.577296 1.30337 0.330624
C  1.488371 -0.811435 1.275552
C  1.189775 0.777562 -0.556334
C  -2.741934 -1.697902 1.031968
C  -1.479245 2.480272 1.117179
C  -1.143478 -2.003638 -0.784722
C  -2.294632 1.360168 -0.889742
C  2.869774 -0.870252 1.021865
C  2.571213 0.731494 -0.830878
C  3.394805 -0.093177 -0.035615
C  -3.446418 -2.846875 0.613508
C  -2.081567 3.685948 0.696614
C  -1.847088 -3.155611 -1.207019
C  -2.897977 2.566272 -1.314919
C  -3.000612 -3.581489 -0.510728
C  -2.793373 3.733704 -0.525083
H  -0.952782 0.024627 1.921708
H  1.063067 -1.414165 2.086278
H  0.541624 1.424489 -1.155249
H  -3.096416 -1.128056 1.900088
H  -0.926382 2.451161 2.064942
H  -0.24424 -1.689128 -1.326235
H  -2.397276 0.456278 -1.50038
H  3.542557 -1.494117 1.615985
H  3.018213 1.318728 -1.637412
H  -4.337999 -3.170848 1.162003
H  -1.999236 4.583651 1.319592
H  -1.492125 -3.719887 -2.076791
H  -3.453158 2.59182 -2.259398
H  -3.5431 -4.475988 -0.836306
H  -3.264718 4.666854 -0.852919
