program: Gaussian 09
title: 000223399
version: EM64L-G09RevD.01
frameworkgroup: C1[X(C17H18O2)]
method: RPBEPBE
basis: SDD
operation: Freq
keyword: #pfreq=noraman
keyword: PBEPBE/SDD
title: #p freq=noraman PBEPBE/SDD
converged: YES YES NO NO
title: Mulliken charges:
elementType: O O C C C C C C C C C C C C C C C C C H H H H H H H H H H H H H H H H H H
charge: -0.419048 -0.229009 0.210255 -0.624404 -0.514820 0.436713 -0.790320 0.500654 -0.390662 -0.377918 0.183391 -0.425648 -0.384693 -0.252313 -0.263340 -0.243123 -0.239917 -0.235508 -0.245071 0.221170 0.214856 0.234175 0.240137 0.234019 0.201401 0.267929 0.245582 0.231291 0.228678 0.251877 0.223333 0.226773 0.227863 0.223441 0.225267 0.227173 0.379816
chargesum: 0.00000
title: Mulliken charges with hydrogens summed into heavy atoms:
elementType: O O C C C C C C C C C C C C C C C C C
charge: -0.039231 -0.229009 0.210255 -0.188379 -0.040508 0.436713 -0.086970 0.500654 -0.145080 -0.146626 0.183391 -0.196970 -0.132817 -0.028980 -0.036568 -0.015260 -0.016477 -0.010241 -0.017898
polarizability: 1.96138223e+02 9.01288519e+00 1.94287602e+02 -2.23660294e+01 -3.51300658e+00 1.42538818e+02
1716.lowfreq: -8.6608 0.0002 0.0005 0.0006 4.0315 7.0071 28.4941 33.9071 44.7482
frequency: 28.4030 33.8381 44.5287 53.0250 61.9106 67.5628 130.1130 147.2150 200.7606 222.3973 234.1178 251.6393 295.8572 324.0053 361.7218 376.1098 402.5540 405.4069 414.5000 449.9081 481.7111 501.2506 538.8693 552.9025 592.4480 617.6865 618.1630 629.2887 676.3159 702.8064 707.1464 715.7828 753.7352 778.8418 799.6655 848.7010 850.4441 855.7654 863.4485 887.5483 912.9836 923.5806 939.5288 951.2336 976.6900 978.0868 990.4544 991.2152 994.5179 995.1020 1026.5137 1027.6535 1046.9234 1073.5263 1081.7215 1097.5995 1131.4397 1147.7124 1170.2566 1173.7990 1176.0841 1189.3213 1194.2355 1202.1291 1218.5640 1289.0306 1292.0295 1316.9669 1325.5412 1328.6987 1336.2986 1376.7035 1382.9555 1395.6916 1434.8213 1440.0349 1450.2069 1470.6883 1481.3682 1482.3751 1487.6781 1491.5893 1588.9215 1591.2667 1612.4224 1613.4586 1658.1570 2977.5816 2988.8725 3004.2513 3034.4716 3075.1855 3078.7406 3107.4666 3113.7699 3119.5565 3122.8800 3127.0926 3135.1160 3140.6352 3145.6125 3156.1722 3162.0338 3168.4507 3505.6977
redmass: 4.5139 7.7303 4.0650 4.3429 6.0002 5.3988 3.6282 4.4111 5.2380 4.3973 4.2770 2.0842 2.1036 1.7769 3.2864 2.1371 2.7812 2.8280 3.1437 2.4744 2.8685 3.6056 3.6242 2.7475 3.2605 6.3894 6.1908 1.6927 3.1424 1.6900 1.6672 4.0744 2.0407 2.2169 3.6237 3.3207 1.2575 1.2803 2.9618 1.9494 1.5050 1.4986 1.8434 2.0057 1.4075 1.3928 5.5826 4.4944 1.3333 1.4189 2.5362 2.2382 1.9363 1.6986 1.7796 1.7584 2.0138 2.3053 1.1730 1.1729 1.3627 1.1297 1.1930 1.1257 2.6909 1.5444 1.9891 1.6568 1.4079 1.3529 1.4414 6.8553 6.8232 1.2061 2.2271 2.1384 1.0927 1.1067 1.2268 2.1361 1.4952 1.1988 5.8826 5.9528 6.0488 6.0902 8.2324 1.0590 1.0381 1.0612 1.1019 1.0976 1.0987 1.0997 1.0868 1.0849 1.0862 1.0875 1.0916 1.0933 1.0961 1.0962 1.1015 1.0981 1.0638
irintensity: 0.0369 1.0077 0.1439 0.0327 0.6264 0.0984 0.2377 1.2262 0.0651 0.2529 0.2660 0.2894 1.8611 0.7695 2.5976 0.4657 0.0949 0.0662 0.3636 11.4271 1.7270 14.3749 27.1631 15.7742 29.0118 0.1137 0.5158 97.7937 38.4626 43.7014 69.8528 10.6017 18.0749 40.8509 21.5864 9.3982 0.0522 0.8575 5.7343 14.7339 0.8525 2.2351 1.4453 3.1140 0.1217 0.1500 0.1569 0.4284 0.0949 0.3312 11.3837 7.3845 92.8444 9.2737 24.0937 36.0106 37.2213 38.2623 0.4485 2.1418 2.2631 1.7481 8.3766 0.2853 0.3778 22.5260 11.1634 27.5701 6.0356 0.8155 5.6411 0.5812 0.6200 19.4777 10.4714 9.1713 13.5568 8.9618 8.8761 18.9642 23.6910 3.4981 1.0344 0.9284 5.9259 5.4381 229.0110 32.2717 19.7512 17.1931 22.1533 20.4695 22.0574 14.7405 7.4712 4.9992 0.2575 2.3858 16.8178 30.0532 39.7684 33.3882 22.6151 10.4349 21.6197
temp: 298.150 k
press: 1.00000 atm
elementType: 8 8 6 6 6 6 6 6 6 6 6 6 6 6 6 6 6 6 6 1 1 1 1 1 1 1 1 1 1 1 1 1 1 1 1 1 1
symmnumber: 1
zpe: 796111.6 jmol-1
zpe.correction: 0.303223 hartree
zpe.thermalcorrener: 0.320552 hartree
zpe.thermalcorrenthalpy: 0.321496 hartree
zpe.thermalcorrgfe: 0.256455 hartree
zpe.sumelectzpe: -807.692651 hartree
zpe.sumelectthermal: -807.675322 hartree
zpe.sumelectthermalent: -807.674378 hartree
zpe.sumelectthermalfe: -807.739419 hartree
dipole: -1.1209 -0.4057 1.0842
dipole: 1.6113
quadrupole: -117.6156 -101.4185 -110.3044
quadrupole: 0.3571 3.3751 -0.1895
quadrupole: -7.8361 8.3610 -0.5249 0.3571 3.3751 -0.1895
hfenergy: -807.9958742 hartree
pointgroup: C01 [X(C17H18O2)]
dipole: 0.4046921 0.1945717 0.4474967 debye
polarizability: 192.2390784|9.4393071|195.4737905|25.0093972|3.8555013|145.2517743 unknown
InChI: InChI=1S/C17H18O2/c1-17(13-16(18)19,15-10-6-3-7-11-15)12-14-8-4-2-5-9-14/h2-11,18H,12-13H2,1H3
charge 0 multiplicity 1
37 atoms
O  -3.475496 1.586068 0.951497
O  -4.113532 0.747314 -1.110818
C  -0.633606 0.998067 -0.112491
C  0.612992 1.242166 -1.061291
C  -1.846138 1.685745 -0.853178
C  -0.889301 -0.51945 0.033202
C  -0.388609 1.701687 1.243552
C  1.9647 0.826811 -0.499088
C  -0.71204 -1.203484 1.261885
C  -1.29459 -1.282714 -1.096852
C  -3.233804 1.278919 -0.398192
C  2.84259 1.793463 0.05792
C  2.388849 -0.52851 -0.528288
C  -0.923483 -2.59845 1.360183
C  -1.507683 -2.674002 -1.005019
C  -1.319604 -3.34246 0.22737
C  4.103668 1.421918 0.576791
C  3.648008 -0.904799 -0.009909
C  4.511108 0.068345 0.545614
H  0.424392 0.706971 -2.012038
H  0.634341 2.32433 -1.300279
H  -1.743335 2.780596 -0.726911
H  -1.80716 1.466915 -1.933755
H  0.504459 1.297703 1.749611
H  -0.211008 2.780974 1.07846
H  -1.261415 1.602323 1.908878
H  -0.40487 -0.652918 2.155579
H  -1.460247 -0.790233 -2.062325
H  2.536879 2.847224 0.078891
H  1.728584 -1.290738 -0.957551
H  -0.776128 -3.101334 2.322907
H  -1.827281 -3.234091 -1.891065
H  -1.484815 -4.423098 0.302647
H  4.767652 2.185513 0.998052
H  3.956914 -1.955881 -0.043325
H  5.489887 -0.22328 0.943069
H  -4.394078 1.280892 1.187271
