program: Gaussian 09
title: 000223398
version: EM64L-G09RevD.01
frameworkgroup: C1[X(C17H17N)]
method: RPBEPBE
basis: SDD
operation: Freq
keyword: #pfreq=noraman
keyword: PBEPBE/SDD
title: #p freq=noraman PBEPBE/SDD
converged: YES YES NO NO
title: Mulliken charges:
elementType: N C C C C C C C C C C C C C C C C C H H H H H H H H H H H H H H H H H
charge: -0.147614 -0.390261 0.450566 -0.550067 -0.661753 -0.368879 -0.371888 -0.230132 -0.233600 -0.271149 0.129541 0.331906 -0.163120 -0.389604 -0.392289 -0.219761 -0.221268 -0.244780 0.227363 0.231943 0.260268 0.246857 0.213842 0.235041 0.214062 0.242671 0.225539 0.218240 0.217215 0.224283 0.252964 0.245258 0.229824 0.228496 0.230286
chargesum: 0.00000
title: Mulliken charges with hydrogens summed into heavy atoms:
elementType: N C C C C C C C C C C C C C C C C C
charge: -0.147614 0.069045 0.450566 -0.042942 0.001191 -0.126208 -0.146349 -0.011893 -0.016385 -0.046865 0.129541 0.331906 -0.163120 -0.136639 -0.147031 0.010063 0.007228 -0.014494
polarizability: 2.73063531e+02 -5.26510312e+00 1.98747119e+02 -4.69839390e+00 1.10410946e+01 1.24381445e+02
1716.lowfreq: -13.1381 -7.4877 -1.8986 0.0008 0.0008 0.0009 11.5006 19.2122 29.5200
frequency: 7.9969 18.6607 29.4644 54.1672 74.7345 90.5579 97.6835 143.1450 193.6797 216.6479 226.0191 291.6750 307.9692 360.5302 376.5468 385.0684 402.0573 419.0450 445.9541 505.0470 508.5389 522.3389 538.4699 596.9732 614.1838 618.0709 692.4994 697.9918 709.2412 725.0129 753.4753 774.4032 788.9012 812.5827 855.0680 868.4321 875.6258 928.0403 946.7322 954.5343 973.2105 975.9221 977.5637 979.9682 986.5001 997.7249 1003.8571 1027.6292 1034.2560 1076.1035 1078.5991 1090.5157 1125.1917 1171.2116 1172.9979 1186.3466 1187.3575 1201.6963 1242.9271 1269.1461 1280.8210 1312.0618 1332.5488 1334.5845 1351.1615 1368.2178 1379.8159 1385.3640 1391.2409 1432.7004 1446.5286 1461.6031 1465.9902 1479.9114 1481.7685 1492.2844 1506.4647 1574.8249 1576.7406 1608.8590 1620.0761 2254.5567 2973.9038 2980.2959 2989.7167 3020.3457 3042.1763 3075.8990 3090.2875 3119.9931 3126.7233 3127.1348 3135.7134 3148.5930 3149.8576 3155.4873 3158.0234 3167.5200 3169.1451
redmass: 3.8202 4.8196 4.2342 3.2573 5.0877 5.0035 2.9638 4.1971 1.6386 1.8154 4.6419 2.8343 5.0260 3.7894 4.2556 2.5001 2.8437 2.9306 4.4431 6.8242 2.8274 3.0331 3.5774 5.1888 6.3301 6.5808 1.8186 1.8446 5.4411 4.4480 1.8714 1.7463 1.1786 1.2548 1.2463 1.5710 2.1594 1.4438 5.3220 1.3825 1.4540 3.7725 2.0728 1.3815 6.1392 1.3191 3.0547 2.0589 2.0268 2.0629 1.6071 1.7106 1.8522 1.0918 1.0553 1.9218 1.1580 1.1204 1.4929 3.6568 1.2853 1.3965 1.2506 1.3718 1.3372 5.3926 4.8715 1.2726 1.8566 2.3578 2.0897 1.1953 1.0523 1.0789 2.2682 1.3467 1.8148 5.7408 5.9997 6.0512 6.0161 11.8115 1.0593 1.0358 1.0620 1.1007 1.1013 1.0995 1.1008 1.0844 1.0885 1.0847 1.0880 1.0929 1.0918 1.0943 1.0970 1.1003 1.1017
irintensity: 0.0140 0.1855 0.4424 0.4969 1.1234 2.2300 0.7415 0.9918 0.4985 0.0602 1.5452 2.1674 2.1041 5.4760 2.8307 1.0146 0.0329 0.5176 6.5595 1.8059 11.7457 4.0590 9.8316 9.7679 0.6038 0.3199 42.6506 42.1171 0.7618 1.2756 82.0508 65.6770 16.0785 0.6126 0.0191 7.7212 7.3651 6.0320 4.2073 0.1254 1.2404 2.2383 23.5640 0.0490 0.2440 0.1788 10.1288 9.0991 27.6486 9.3255 9.0332 1.2947 39.0096 1.1106 0.0039 51.2325 4.3784 9.0961 67.6567 13.0159 16.4503 0.0504 50.5374 33.2595 54.4810 0.0685 8.1960 26.3182 33.6991 6.0764 5.1553 13.8191 9.7195 3.2296 44.0053 49.9662 129.9404 2.0746 8.7074 20.2376 180.0986 0.7180 38.1674 33.5987 29.9867 8.9766 6.5169 47.4603 42.9835 7.8219 9.9718 1.7098 3.1895 21.2332 36.8266 42.0133 30.1773 7.1898 17.6965
temp: 298.150 k
press: 1.00000 atm
elementType: 7 6 6 6 6 6 6 6 6 6 6 6 6 6 6 6 6 6 1 1 1 1 1 1 1 1 1 1 1 1 1 1 1 1 1
symmnumber: 1
zpe: 755773.3 jmol-1
zpe.correction: 0.287859 hartree
zpe.thermalcorrener: 0.304602 hartree
zpe.thermalcorrenthalpy: 0.305547 hartree
zpe.thermalcorrgfe: 0.239403 hartree
zpe.sumelectzpe: -711.419979 hartree
zpe.sumelectthermal: -711.403235 hartree
zpe.sumelectthermalent: -711.402291 hartree
zpe.sumelectthermalfe: -711.468434 hartree
dipole: -0.9459 1.7494 -0.3066
dipole: 2.0122
quadrupole: -98.0153 -97.1822 -106.0229
quadrupole: 4.3294 -2.9174 2.1300
quadrupole: 2.3915 3.2246 -5.6161 4.3294 -2.9174 2.1300
hfenergy: -711.7078377 hartree
pointgroup: C01 [X(C17H17N1)]
dipole: -0.3438518 0.6932675 -0.1670364 debye
polarizability: 272.5884846|-8.4400714|200.3802842|-2.6370726|6.3698779|123.2233262 unknown
InChI: InChI=1S/C17H17N/c1-2-18(17-13-7-4-8-14-17)15-9-12-16-10-5-3-6-11-16/h3-8,10-11,13-14H,2,15H2,1H3
charge 0 multiplicity 1
35 atoms
N  1.978182 1.121888 0.123879
C  2.234154 2.053967 -0.991623
C  2.547997 -0.164966 0.168794
C  0.967072 1.53322 1.112459
C  3.393655 3.041733 -0.721621
C  2.053254 -1.165767 1.063307
C  3.650397 -0.513181 -0.673777
C  2.648864 -2.442415 1.117853
C  4.226536 -1.797991 -0.614151
C  3.739929 -2.776718 0.283285
C  -0.420816 1.119083 0.789376
C  -2.892257 0.33683 0.134183
C  -1.569599 0.770073 0.490746
C  -3.087537 -0.913894 -0.522493
C  -4.029648 1.143631 0.430125
C  -4.384969 -1.339985 -0.873552
C  -5.324129 0.709157 0.078007
C  -5.508225 -0.532519 -0.575255
H  2.433232 1.472371 -1.910273
H  1.302396 2.61976 -1.18524
H  1.248899 1.143342 2.110083
H  0.999244 2.636677 1.198261
H  3.185954 3.658395 0.172043
H  4.341283 2.503421 -0.545629
H  3.532489 3.722824 -1.582227
H  1.180237 -0.964716 1.691157
H  4.076026 0.22423 -1.361182
H  2.242355 -3.187441 1.812187
H  5.073413 -2.030397 -1.270897
H  4.195499 -3.771257 0.328103
H  -2.216118 -1.536698 -0.7508
H  -3.885061 2.104686 0.935197
H  -4.521645 -2.302352 -1.379252
H  -6.190463 1.338003 0.311788
H  -6.5151 -0.867098 -0.848456
