program: Gaussian 09
title: 000223394
version: EM64L-G09RevD.01
frameworkgroup: C1[X(C12H20O5)]
method: RPBEPBE
basis: SDD
operation: Freq
keyword: #pfreq=noraman
keyword: PBEPBE/SDD
title: #p freq=noraman PBEPBE/SDD
converged: YES YES NO NO
title: Mulliken charges:
elementType: O O O O O C C C C C C C C C C C C H H H H H H H H H H H H H H H H H H H H
charge: -0.217664 -0.425997 -0.406263 -0.253215 -0.282564 0.331038 -0.075658 -0.520951 -0.536056 0.154075 -0.755690 -0.745436 -0.497876 -0.526626 -0.806118 0.193347 0.215358 0.225229 0.266299 0.230643 0.227454 0.270990 0.220554 0.223319 0.222972 0.252758 0.232181 0.205366 0.248309 0.237291 0.257880 0.288404 0.249184 0.257790 0.250316 0.407803 0.381556
chargesum: 0.00000
title: Mulliken charges with hydrogens summed into heavy atoms:
elementType: O O O O O C C C C C C C C C C C C
charge: -0.217664 -0.018194 -0.024707 -0.253215 -0.282564 0.331038 0.149570 -0.024009 -0.037613 0.154075 -0.088844 -0.055132 -0.012276 0.019658 -0.048829 0.193347 0.215358
polarizability: 1.55710879e+02 -6.10335578e+00 1.39236641e+02 -4.68553562e+00 -2.84585529e+00 1.27893376e+02
1716.lowfreq: -10.0125 -7.2258 -5.5407 0.0002 0.0003 0.0004 25.2345 50.1329 66.5999
frequency: 25.0863 49.9559 66.4606 72.6134 88.8730 97.2199 110.7480 137.7748 145.5883 160.7508 166.5771 181.5757 193.1371 218.0950 244.2794 266.2016 274.8787 326.4080 344.0078 358.5471 368.2663 412.9457 431.8763 436.7779 456.1977 473.7673 538.1939 541.8993 559.5695 592.9895 605.5475 613.6862 665.0039 685.5952 705.1288 771.4693 784.3560 834.0772 869.8286 876.0442 906.3240 919.9419 929.7064 958.9144 960.1750 992.6343 1009.1441 1024.0529 1046.9568 1067.9680 1093.4317 1100.0065 1108.3603 1127.8849 1155.6476 1175.1882 1182.9898 1203.2662 1219.5539 1259.3050 1265.7513 1294.6772 1298.1297 1312.0945 1320.2099 1345.4823 1352.3214 1366.6554 1370.6381 1381.8839 1386.1809 1406.7076 1441.0949 1448.8890 1453.1884 1455.2075 1456.6183 1471.2879 1476.5916 1489.5084 1497.6999 1512.2108 1602.7005 1638.4319 1642.8526 2966.8816 2977.9192 2984.1281 2988.8335 2996.2610 3003.1514 3016.3015 3016.9490 3064.2938 3068.4560 3071.3694 3073.5169 3076.4196 3084.7791 3089.9204 3093.1823 3097.4167 3118.5698 3394.4663 3500.5238
redmass: 6.2580 3.5108 4.7223 3.4692 5.5960 4.4081 8.7784 4.9723 3.9617 2.9633 1.1740 4.7415 3.4777 1.1875 3.0727 1.1722 3.2460 2.6143 2.6084 3.3602 2.3558 2.3830 3.0866 2.7021 2.6858 2.8173 3.6996 3.3048 2.7512 1.6954 2.0458 2.7193 2.1104 1.8717 3.1294 1.6061 2.8979 2.8514 3.0466 2.9551 2.0536 1.5070 1.9219 1.5207 1.7037 1.6976 2.6598 3.0255 2.5928 2.1316 2.0302 2.2838 2.9944 2.1496 2.1115 2.2134 1.8913 1.3729 1.6475 1.2960 1.4797 1.3210 1.2527 1.4176 1.3394 1.4012 1.4495 1.2647 1.5669 1.4602 1.2354 1.1969 1.0878 1.0852 1.0892 1.0691 1.0793 1.0536 1.0495 1.0524 1.0476 1.0748 7.5977 7.5331 7.5206 1.0826 1.0359 1.0372 1.0369 1.0641 1.0649 1.0626 1.0610 1.0977 1.0974 1.0977 1.0988 1.0980 1.0962 1.0978 1.1001 1.0989 1.1004 1.0634 1.0637
irintensity: 2.2141 1.5344 0.8727 6.2753 7.9715 5.3552 0.4608 0.7836 2.4206 0.1834 0.5061 2.3728 5.7599 0.4292 2.6702 0.1878 2.7143 3.8674 2.4490 3.4367 1.8822 8.2607 3.6872 1.1981 3.5862 3.3989 64.2371 48.4702 13.6771 116.6373 105.4275 27.5891 57.6682 57.0672 130.6173 10.4341 10.5786 1.6570 5.9719 5.7189 6.2080 3.2410 1.7418 2.9911 7.1824 26.7917 5.1081 33.0315 28.8547 112.6002 187.1198 88.4174 7.3094 54.8558 12.0848 48.9357 65.1913 18.3081 17.8174 2.2142 4.9545 15.2661 17.4590 12.7011 7.7708 17.9451 3.9364 60.0342 48.5707 20.8508 27.5931 24.8497 25.0085 13.2788 15.4406 21.8209 37.0899 1.3487 3.9380 6.6851 17.2568 19.6718 84.5754 159.8403 230.5997 21.6433 23.6965 2.1213 27.6411 10.6545 20.1470 14.6663 23.3997 1.4411 13.6002 13.3332 28.8823 47.4842 12.1874 10.3736 14.2461 26.8825 13.3677 157.6131 28.7146
temp: 298.150 k
press: 1.00000 atm
elementType: 8 8 8 8 8 6 6 6 6 6 6 6 6 6 6 6 6 1 1 1 1 1 1 1 1 1 1 1 1 1 1 1 1 1 1 1 1
symmnumber: 1
zpe: 804870.3 jmol-1
zpe.correction: 0.306559 hartree
zpe.thermalcorrener: 0.325926 hartree
zpe.thermalcorrenthalpy: 0.326870 hartree
zpe.thermalcorrgfe: 0.259013 hartree
zpe.sumelectzpe: -844.057116 hartree
zpe.sumelectthermal: -844.037749 hartree
zpe.sumelectthermalent: -844.036805 hartree
zpe.sumelectthermalfe: -844.104662 hartree
dipole: -0.0273 3.7948 0.9047
dipole: 3.9012
quadrupole: -108.5580 -103.5423 -103.3965
quadrupole: -2.4430 -4.6845 2.1745
quadrupole: -3.3924 1.6233 1.7691 -2.4430 -4.6845 2.1745
hfenergy: -844.3636751 hartree
pointgroup: C01 [X(C12H20O5)]
dipole: 1.5206046 -0.2011489 -0.0554653 debye
polarizability: 139.1811632|9.1873971|153.7064479|-5.3861758|2.4779989|129.9532855 unknown
InChI: InChI=1S/C12H20O5/c1-8(2)12(9(3)13,6-4-10(14)15)7-5-11(16)17/h8,14,16H,4-7H2,1-3H3
charge 0 multiplicity 1
37 atoms
O  -1.425435 -2.633819 1.217578
O  -1.408071 2.465208 1.26861
O  2.937431 2.868926 -0.944295
O  -1.603132 2.497479 -1.045358
O  1.16779 3.238868 0.48725
C  -0.110548 -0.984074 -0.028224
C  0.631606 -1.902052 -1.109626
C  -1.47867 -0.527561 -0.641778
C  0.802499 0.220229 0.373319
C  -0.423364 -1.864743 1.223852
C  1.983144 -2.480396 -0.617058
C  -0.236767 -3.053641 -1.67406
C  -2.317796 0.492843 0.185502
C  1.284851 1.114363 -0.80297
C  0.477528 -1.817805 2.453451
C  -1.777087 1.903765 0.047428
C  1.745257 2.480533 -0.332921
H  0.850433 -1.215011 -1.954165
H  -2.09718 -1.432829 -0.749941
H  -1.318305 -0.112512 -1.655263
H  1.700735 -0.151662 0.897744
H  0.266588 0.849146 1.105297
H  2.657298 -1.711091 -0.199514
H  2.512886 -2.954427 -1.463337
H  1.830998 -3.26298 0.149525
H  -0.600473 -3.718575 -0.871387
H  -1.114117 -2.685146 -2.231661
H  0.368413 -3.658955 -2.374579
H  -2.377719 0.2066 1.247992
H  -3.344488 0.486285 -0.225249
H  2.106993 0.645748 -1.367486
H  0.457057 1.305935 -1.513685
H  0.439574 -0.817449 2.924509
H  0.129938 -2.569616 3.179024
H  1.534269 -2.012121 2.196528
H  -0.75356 3.207875 1.104995
H  3.177424 3.789859 -0.647448
