program: Gaussian 09
title: 000223387
version: EM64L-G09RevD.01
frameworkgroup: C1[X(C11H18N2)]
method: RPBEPBE
basis: SDD
operation: Freq
keyword: #pfreq=noraman
keyword: PBEPBE/SDD
title: #p freq=noraman PBEPBE/SDD
converged: YES YES NO NO
title: Mulliken charges:
elementType: N N C C C C C C C C C C C H H H H H H H H H H H H H H H H H H
charge: -0.276284 -0.000292 -0.356493 -0.365853 -0.367198 -0.558075 -0.342351 0.477572 -0.689133 -0.335410 -0.501467 -0.189395 -0.334521 0.173614 0.207527 0.213916 0.174375 0.193966 0.223895 0.237869 0.199665 0.231507 0.191438 0.194103 0.216147 0.208106 0.212018 0.241851 0.249899 0.228574 0.240431
chargesum: 0.00000
title: Mulliken charges with hydrogens summed into heavy atoms:
elementType: N N C C C C C C C C C C C
charge: -0.038415 -0.000292 0.024649 0.022438 0.050663 -0.126903 0.043189 0.477572 -0.052862 -0.093559 -0.251568 0.039178 -0.094090
polarizability: 1.80678898e+02 -3.84318431e+00 1.19338681e+02 1.54483241e+01 9.52846527e-01 9.47223132e+01
1716.lowfreq: -12.7730 -3.5830 0.0005 0.0006 0.0007 3.1557 22.0721 39.9077 45.0049
frequency: 21.6268 39.6899 44.6992 60.0059 96.3955 105.3659 131.7581 148.2041 211.7192 216.0456 229.1627 312.0454 334.9730 397.4722 420.3556 443.3513 514.8423 595.3943 628.1298 674.1785 724.9105 737.9579 789.3306 799.1612 804.1437 827.4014 894.8313 924.8877 933.5796 940.2703 984.7764 996.1470 1002.2867 1022.1394 1028.6642 1044.6224 1045.0333 1081.9194 1108.3468 1124.7395 1133.1328 1147.0936 1191.7144 1196.0126 1224.4221 1231.6206 1258.3510 1273.9039 1278.5101 1282.5953 1293.2577 1310.6708 1333.0759 1339.8990 1353.0887 1385.0529 1392.6118 1414.0899 1453.5403 1458.9017 1467.4929 1472.3608 1474.6194 1477.5280 1484.8646 1489.6339 1498.3921 1557.0453 1586.5846 2843.6193 2853.5489 2955.9065 2968.1838 2973.6857 2975.2001 2994.1221 3007.9438 3008.1057 3040.1467 3056.6959 3070.3369 3073.0886 3114.4519 3122.6663 3131.5687 3162.0096 3418.8541
redmass: 4.1213 2.6182 3.0543 2.2571 2.1528 3.8725 2.1613 2.1872 3.9095 3.5494 1.1391 2.9961 2.5638 3.1074 4.2872 3.0599 3.4321 5.9117 5.6887 1.3465 1.8653 1.0731 1.1732 2.2974 1.1844 2.5383 1.8286 1.3482 1.1895 1.4725 1.4082 2.5109 3.4058 2.8930 3.1592 3.0576 2.0012 2.2687 1.5092 2.3032 1.3487 3.7926 1.5067 1.5550 1.3745 1.8025 1.3053 1.1799 1.1406 1.0913 1.4189 6.7429 1.3702 1.2165 1.5266 1.4007 1.2569 2.0733 1.2521 2.1131 1.0707 1.0788 1.0772 1.0451 1.0738 1.0908 1.0860 5.4671 5.9281 1.0713 1.0710 1.0639 1.0605 1.0365 1.0654 1.0843 1.0902 1.0927 1.1014 1.0985 1.1005 1.0995 1.0907 1.0887 1.0915 1.0998 1.0739
irintensity: 0.7765 0.0453 0.0902 0.6191 0.7611 0.3478 3.0113 2.3208 0.2796 0.6603 0.0359 1.4872 0.9105 3.6437 1.3376 3.3215 10.1220 5.8967 5.7862 82.7629 33.7962 10.4285 2.6067 18.3971 0.3925 17.0133 7.0982 2.3186 2.4650 1.4659 0.1119 0.7334 5.9441 3.0552 0.0635 0.6563 7.4180 1.0974 23.5616 4.6232 31.2952 63.8447 2.0163 0.5547 1.8930 1.2144 5.0465 2.6788 0.5252 0.3099 0.8765 0.1540 14.1689 2.4202 18.4448 1.6195 8.0391 19.7534 49.2665 14.0536 1.1229 0.5273 5.3662 12.6082 15.6871 2.7224 7.7029 5.3905 0.8619 58.0106 155.3878 10.3142 55.3718 35.7975 28.5433 33.6936 28.8440 7.3131 47.5679 22.6307 84.8144 57.5058 24.4860 6.9514 23.0382 27.7114 2.0793
temp: 298.150 k
press: 1.00000 atm
elementType: 7 7 6 6 6 6 6 6 6 6 6 6 6 1 1 1 1 1 1 1 1 1 1 1 1 1 1 1 1 1 1
symmnumber: 1
zpe: 709808.8 jmol-1
zpe.correction: 0.270352 hartree
zpe.thermalcorrener: 0.284589 hartree
zpe.thermalcorrenthalpy: 0.285533 hartree
zpe.thermalcorrgfe: 0.226721 hartree
zpe.sumelectzpe: -538.440260 hartree
zpe.sumelectthermal: -538.426023 hartree
zpe.sumelectthermalent: -538.425079 hartree
zpe.sumelectthermalfe: -538.483891 hartree
dipole: 2.0826 3.0990 0.4867
dipole: 3.7653
quadrupole: -86.7730 -79.7546 -81.4100
quadrupole: -10.0585 -1.2976 0.5538
quadrupole: -4.1271 2.8913 1.2359 -10.0585 -1.2976 0.5538
hfenergy: -538.7106116 hartree
pointgroup: C01 [X(C11H18N2)]
dipole: 0.817424 -1.2321001 0.0910763 debye
polarizability: 180.8866891|0.2586089|118.5251784|-15.3558032|-4.4821497|95.3280249 unknown
InChI: InChI=1S/C11H18N2/c1-2-3-7-12-9-6-11-5-4-8-13-10-11/h4-5,8,10,12H,2-3,6-7,9H2,1H3
charge 0 multiplicity 1
31 atoms
N  1.694989 -0.090816 -0.516018
N  -4.128867 1.271811 0.162991
C  2.799325 -0.039476 0.468196
C  4.169802 -0.013001 -0.235953
C  0.339426 -0.110218 0.064612
C  -0.734144 -0.045586 -1.053441
C  5.35557 0.038994 0.753742
C  -2.144229 -0.033679 -0.494019
C  6.72599 0.061563 0.043066
C  -2.779571 -1.217238 -0.037266
C  -2.873963 1.177967 -0.367732
C  -4.077646 -1.145879 0.514167
C  -4.71181 0.115374 0.597576
H  2.77402 -0.894818 1.192104
H  2.676781 0.88457 1.068433
H  4.202612 0.861191 -0.914856
H  4.271726 -0.915388 -0.877008
H  0.143468 -1.005974 0.708282
H  0.23225 0.775671 0.720812
H  1.830001 -0.860913 -1.187729
H  -0.601042 -0.917809 -1.726003
H  -0.543059 0.860392 -1.656583
H  5.305637 -0.835065 1.434922
H  5.256606 0.939016 1.394374
H  7.557832 0.103625 0.769946
H  6.86576 -0.843144 -0.578499
H  6.812811 0.941254 -0.622007
H  -2.265733 -2.182673 -0.121662
H  -2.433143 2.12225 -0.712741
H  -4.592295 -2.044244 0.87025
H  -5.718605 0.215245 1.019244
