program: Gaussian 09
title: 000223378
version: EM64L-G09RevD.01
frameworkgroup: C1[X(C9H8BrNO4)]
method: RPBEPBE
basis: SDD
operation: Freq
keyword: #p
keyword: freq=noraman
keyword: PBEPBE/SDD
title: #p freq=noraman PBEPBE/SDD
converged: YES YES NO NO
title: Mulliken charges:
elementType: Br O O O O N C C C C C C C C C H H H H H H H H
charge: 0.004908 -0.403756 -0.228258 -0.200704 -0.201162 0.018955 -0.692309 0.646032 -0.447402 -0.471836 -0.404113 0.379816 -0.181993 -0.372073 0.202236 0.322436 0.280346 0.288803 0.290847 0.246534 0.244787 0.291720 0.386186
chargesum: 0.00000
title: Mulliken charges with hydrogens summed into heavy atoms:
elementType: Br O O O O N C C C C C C C C C
charge: 0.004908 -0.017570 -0.228258 -0.200704 -0.201162 0.018955 -0.369873 0.646032 0.121747 -0.180989 -0.157579 0.379816 0.062794 -0.080353 0.202236
polarizability: 1.62517866e+02 1.25669558e+01 1.06762489e+02 4.99024677e+00 5.57025375e+00 1.37442908e+02
1716.lowfreq: -3.8749 -0.0007 -0.0005 0.0003 6.7811 8.5871 18.5468 32.9623 43.1056
frequency: 18.3631 32.9527 43.0688 59.2188 76.9173 118.3031 142.6301 170.7099 204.0872 232.2955 273.3589 320.0569 378.0277 423.5859 468.5231 490.3995 509.0471 528.7237 561.2644 571.0186 645.4510 656.7304 658.9327 693.8815 717.5517 746.8215 822.3698 860.4508 865.7772 939.3176 952.2108 980.5330 990.1795 1004.1371 1038.8509 1069.5837 1089.6912 1102.0735 1158.4053 1180.0466 1183.0082 1209.1852 1227.5419 1258.0194 1282.8400 1337.5229 1362.7848 1374.8082 1406.2181 1439.6637 1447.8772 1479.9518 1590.6875 1615.6790 1658.1173 3023.0219 3085.4960 3104.1015 3143.3740 3164.7027 3170.0383 3188.7794 3512.1319
redmass: 8.5087 10.0383 10.4699 10.3202 10.0757 7.7808 4.2585 5.5017 8.0210 6.6633 4.5010 5.0663 8.9572 3.1997 3.6345 5.3959 3.4258 3.0341 4.4672 4.1615 1.7946 4.5579 4.2280 2.0568 6.2304 8.3534 1.4987 4.4514 3.7464 1.5200 1.4407 2.3707 5.9168 1.3698 3.1161 1.9592 2.1112 1.7923 1.1685 1.1590 1.1817 4.2075 3.0223 1.5759 1.3288 1.8472 1.9210 11.4375 4.6769 1.9289 1.2512 2.8095 6.4595 7.0569 8.5096 1.0640 1.0943 1.0897 1.0890 1.0936 1.0919 1.0968 1.0641
irintensity: 1.8540 1.7120 0.3964 0.4372 0.9478 3.6974 0.5560 2.9487 0.5652 3.8877 0.5460 1.7680 1.5009 0.2765 15.9341 5.8804 12.3029 49.8488 66.0567 9.0066 86.2628 7.3938 55.8933 65.4835 7.9423 21.1889 21.7839 3.7603 3.6686 1.4094 8.0371 21.8116 2.8753 0.7011 159.6145 115.6206 21.0752 22.8516 10.7626 17.1823 1.4610 170.7597 99.0689 6.2601 0.9663 60.6697 40.9000 114.1510 0.5608 1.2046 55.9089 14.9226 4.2907 1.7646 184.9450 6.0847 0.4826 3.0853 4.6692 7.4805 4.1429 4.3282 32.4200
temp: 298.150 k
press: 1.00000 atm
elementType: 35 8 8 8 8 7 6 6 6 6 6 6 6 6 6 1 1 1 1 1 1 1 1
symmnumber: 1
zpe: 419058.4 jmol-1
zpe.correction: 0.159611 hartree
zpe.thermalcorrener: 0.173821 hartree
zpe.thermalcorrenthalpy: 0.174765 hartree
zpe.thermalcorrgfe: 0.114569 hartree
zpe.sumelectzpe: -715.701146 hartree
zpe.sumelectthermal: -715.686936 hartree
zpe.sumelectthermalent: -715.685992 hartree
zpe.sumelectthermalfe: -715.746188 hartree
dipole: -2.9124 1.9017 2.8832
dipole: 4.5179
quadrupole: -108.7105 -92.1800 -95.8237
quadrupole: -4.0627 13.2876 -4.3968
quadrupole: -9.8058 6.7247 3.0811 -4.0627 13.2876 -4.3968
hfenergy: -715.8607568 hartree
pointgroup: C01 [X(C9H8Br1N1O4)]
dipole: -1.3746463 -0.7170339 0.8692598 debye
dipolederiv: -0.2470629 0.0215533 -0.0557477 -0.0180245 -0.1788809 -0.1499553 -0.2979412 -0.1785735 -0.6917073 -0.4927934 0.2366828 0.0119831 0.3519223 -1.1907367 -0.1997289 0.0871775 -0.2773292 -0.3273884 -0.4112667 0.0157947 0.1186356 0.1893084 -0.7684764 0.0189549 0.1020213 0.259238 -0.7156431 -0.8458761 -0.0820585 -0.201179 -0.146153 -0.4179002 0.0592199 -0.1543083 0.0939347 -0.3391262 -0.4913575 -0.0783682 -0.0591932 -0.0935207 -0.663546 0.2383266 -0.0458159 0.2571864 -0.3904393 1.3580061 0.4077096 0.2173707 0.5189195 1.0859896 -0.3491972 0.1281729 -0.4222897 0.4890659 0.4843247 -0.0387976 0.1559642 -0.0335166 0.199959 0.2425685 0.3034026 0.2890879 0.980476 -0.0385946 -0.0458296 0.0714479 -0.0082869 -0.1959192 0.0495091 0.1343407 0.0196142 -0.0998944 0.0178574 0.0491489 -0.0437199 0.0132533 -0.0091324 0.0540312 0.0789928 -0.1738133 -0.4577155 0.026243 0.1740918 -0.0570518 0.0082456 -0.0309073 -0.0152446 0.0739785 0.0216841 -0.0649016 0.072344 0.1027146 -0.0268409 0.0146832 0.049719 -0.1066091 -0.0227604 -0.0591148 -0.0591292 -0.2753648 -0.2634856 0.011279 -0.2831315 -0.2207692 0.0784423 0.0543023 0.0815271 0.0273686 -0.2596427 -0.1144558 0.0059437 -0.1026439 0.0416281 -0.1515237 0.0344632 -0.1575584 0.0187003 -0.0268761 -0.0193524 0.0323035 0.2007617 0.0309355 -0.0103109 -0.0999645 -0.0947646 -0.0886417 0.383331 -0.2502051 -0.1821911 -0.479848 1.5186991 0.0543672 -0.3288331 0.0496649 1.072685 0.0263627 0.0000855 -0.0023326 -0.039698 0.0016628 -0.0229857 0.0255281 0.0456858 -0.057342 0.0721641 -0.0786203 0.0753675 -0.0576007 0.0235003 -0.0132388 0.037985 0.0185912 0.0932482 -0.0417159 0.0300682 -0.0360814 0.0335252 0.1057605 -0.0174174 -0.0465889 0.0059869 0.0761806 0.1606995 0.0176457 -0.0162543 0.041123 0.0849224 0.0508944 -0.0476681 0.0435309 0.0974849 0.0098356 -0.1011234 0.0168384 -0.0843643 0.0546969 0.0158572 -0.00011 0.0252722 0.1186362 0.0743608 0.0116887 -0.0415968 0.0133963 0.0026958 0.1077846 -0.0404818 0.1096029 0.0651872 0.063025 0.0130149 -0.0500931 -0.0160404 0.1460589 0.0081773 -0.0415206 0.0196562 0.1392602 0.3819967 -0.0079021 0.055148 -0.0223102 0.3300403 0.0580785 0.0656276 0.0231803 0.1136357 unknown
polarizability: 149.6369256|10.6265912|125.3735149|24.1020827|-11.8930888|131.7128219 unknown
InChI: InChI=1S/C9H8BrNO4/c10-8(5-9(12)13)6-2-1-3-7(4-6)11(14)15/h1-4,8,12H,5H2
charge 0 multiplicity 1
23 atoms
Br -1.676924 -1.206684 -2.883211
O  -3.13407 2.255638 0.872246
O  -2.918404 0.06953 1.632664
O  4.037848 0.88644 0.392039
O  2.562405 2.017559 -0.928322
N  2.881427 1.028729 -0.162394
C  -1.779327 -0.758101 -0.868031
C  -0.400207 -0.858375 -0.26119
C  -2.467676 0.610394 -0.744835
C  0.588394 0.1234 -0.506375
C  -0.087834 -1.953791 0.585191
C  1.850915 -0.011293 0.100989
C  1.186994 -2.069551 1.183328
C  2.176216 -1.094597 0.946511
C  -2.842131 0.901406 0.702429
H  -2.433516 -1.55139 -0.477336
H  -1.84462 1.431628 -1.135468
H  -3.400501 0.619958 -1.339131
H  0.410711 0.975509 -1.168945
H  -0.852916 -2.712243 0.784469
H  1.406751 -2.919012 1.837249
H  3.172573 -1.15336 1.39184
H  -3.409608 2.425806 1.814182
