program: Gaussian 09
title: 000223375
version: EM64L-G09RevD.01
frameworkgroup: C1[X(C8H14O4)]
method: RPBEPBE
basis: SDD
operation: Freq
keyword: #pfreq=noraman
keyword: PBEPBE/SDD
title: #p freq=noraman PBEPBE/SDD
converged: YES YES NO NO
title: Mulliken charges:
elementType: O O O O C C C C C C C C H H H H H H H H H H H H H H
charge: -0.411927 -0.422626 -0.224960 -0.219913 -0.122628 -0.061353 -0.180796 -0.741409 -0.719482 -0.713722 0.125094 0.170471 0.236762 0.257851 0.260418 0.242238 0.218917 0.204241 0.205927 0.235392 0.217861 0.213757 0.250242 0.226025 0.375163 0.378458
chargesum: 0.00000
title: Mulliken charges with hydrogens summed into heavy atoms:
elementType: O O O O C C C C C C C C
charge: -0.036764 -0.044168 -0.224960 -0.219913 0.114134 0.196498 0.079622 -0.076013 -0.060302 -0.023699 0.125094 0.170471
polarizability: 1.00378880e+02 -5.03880769e+00 1.01261527e+02 1.91646677e+00 2.74931093e+00 9.11116931e+01
1716.lowfreq: -13.9803 0.0006 0.0007 0.0008 8.0016 12.9942 22.8466 45.1020 71.7280
frequency: 21.4493 44.5707 71.7161 84.3229 126.5426 161.4761 166.7793 195.0185 218.5664 229.8322 248.4385 285.6652 303.6575 351.6467 378.3607 416.8418 459.2155 477.3956 577.2135 580.5288 601.0255 636.1039 697.0942 743.4355 758.8014 844.7801 870.0558 918.9706 924.6812 957.4957 979.1117 1023.1264 1029.5387 1041.6198 1089.4033 1113.0281 1136.7854 1160.8868 1173.9867 1208.0177 1240.4743 1255.7817 1273.1125 1315.1437 1327.3296 1350.2935 1367.9908 1379.7210 1396.6035 1402.7992 1463.2121 1466.1371 1477.7526 1479.7764 1480.2528 1498.8508 1650.7041 1669.3401 2971.6343 2974.6913 2999.4796 3012.8595 3028.4463 3037.1628 3062.7650 3072.2832 3077.6276 3086.4878 3094.7184 3107.6798 3494.6725 3508.0702
redmass: 9.0300 5.6415 3.3150 4.6925 5.9979 3.6113 3.2076 1.0578 1.2445 1.4562 2.0148 4.2328 2.8364 3.3876 2.6770 2.6612 3.3959 3.1322 2.2274 2.6801 2.3293 1.4115 3.0575 3.2036 4.6058 2.2720 2.8436 1.7177 1.4151 1.5753 1.9900 2.4605 1.9100 2.3117 1.8932 2.4421 2.3906 2.0574 1.9205 1.3290 1.4394 1.5413 1.3291 1.4107 1.5001 1.5713 1.7687 1.2158 1.2060 1.1972 1.0520 1.0468 1.0516 1.0567 1.0452 1.0454 8.5548 8.1747 1.0367 1.0373 1.0362 1.0825 1.0854 1.0834 1.0984 1.0981 1.0990 1.0987 1.1003 1.0996 1.0637 1.0638
irintensity: 2.8642 1.0200 0.2016 0.0668 0.2298 0.1580 1.0287 0.2505 0.2549 0.1818 2.5641 0.4145 1.5490 2.0099 3.1148 2.0193 30.3499 9.6316 37.6922 24.9033 40.8454 187.8498 23.7647 8.4865 26.7944 5.3375 5.2057 0.1425 9.2764 6.8060 14.7434 95.4181 188.0472 146.9624 45.4957 40.5613 11.7857 6.7979 9.0928 13.1035 1.8190 5.4197 8.6196 2.3875 1.9568 2.2269 39.4677 17.4471 17.0376 23.6600 0.8428 13.1306 11.5142 3.8949 8.7093 23.7871 161.5836 235.7688 27.6705 28.7255 19.4594 3.1455 6.2132 4.9768 6.4359 54.7472 45.8278 34.0971 26.7727 20.0713 22.3941 23.3538
temp: 298.150 k
press: 1.00000 atm
elementType: 8 8 8 8 6 6 6 6 6 6 6 6 1 1 1 1 1 1 1 1 1 1 1 1 1 1
symmnumber: 1
zpe: 558243.6 jmol-1
zpe.correction: 0.212624 hartree
zpe.thermalcorrener: 0.226735 hartree
zpe.thermalcorrenthalpy: 0.227679 hartree
zpe.thermalcorrgfe: 0.171058 hartree
zpe.sumelectzpe: -613.202513 hartree
zpe.sumelectthermal: -613.188401 hartree
zpe.sumelectthermalent: -613.187457 hartree
zpe.sumelectthermalfe: -613.244078 hartree
dipole: 1.6232 -0.8206 1.6159
dipole: 2.4329
quadrupole: -77.0347 -65.2160 -73.1059
quadrupole: 2.9167 -1.6248 2.4036
quadrupole: -5.2491 6.5695 -1.3204 2.9167 -1.6248 2.4036
hfenergy: -613.4151367 hartree
pointgroup: C01 [X(C8H14O4)]
dipole: -0.5481305 0.4922962 0.611066 debye
dipolederiv: -0.4709557 -0.2434837 0.1083102 -0.2545834 -0.9295198 0.4374778 0.0920087 0.3408222 -0.4401311 -0.3919925 -0.0601438 -0.0301537 0.0085517 -1.0010428 0.3402809 -0.0890767 0.4200101 -0.4798856 -0.3654444 -0.0981466 0.0830984 -0.0583433 -0.5950057 -0.1452861 0.111888 0.0991546 -0.8588377 -0.6949907 0.3005682 0.104821 0.2216862 -0.6994357 0.1129872 0.2838821 -0.0777959 -0.459755 0.1065831 -0.0225328 -0.0988473 -0.0461997 -0.1691492 -0.0655603 -0.0299393 -0.0731439 -0.0513783 0.0925183 -0.0598833 -0.0133739 -0.0769751 0.1968118 -0.0010255 0.0140141 -0.0745555 0.0492887 -0.0654088 0.0761051 0.1890728 0.0645556 0.0135653 -0.0084098 0.1548277 0.0348763 0.0145152 0.0117447 0.01249 -0.0357464 0.0100217 -0.1015228 -0.0697461 -0.0505469 -0.0110356 0.0790957 -0.057808 -0.0161142 -0.0438614 0.0214379 0.0041677 -0.0094034 -0.0747036 -0.0118353 0.0835492 -0.0100025 0.0325684 -0.0271789 0.0303672 0.0156522 0.0197046 -0.0174953 0.0481893 0.027576 0.2925915 0.3542246 -0.2340632 0.3624739 1.2985672 -0.1036092 -0.2083627 -0.1900306 1.115124 0.8048989 -0.2915585 -0.3128952 -0.3280898 1.2926363 -0.3681167 -0.4962408 -0.3232167 0.6839036 -0.0076375 -0.0152873 0.0920586 -0.0241985 0.0432075 0.01178 0.0510484 0.0220604 -0.059319 0.0343199 -0.0136525 0.0626057 0.010752 0.0390468 -0.0091654 0.0598649 0.0127034 -0.0688829 0.0786108 -0.045892 -0.0115233 -0.04108 -0.0653254 -0.0534285 0.0293892 -0.0441237 0.0275761 -0.1183094 -0.1053653 -0.0284095 -0.0903047 0.0858369 -0.0191718 -0.0267123 -0.0194303 0.0706376 -0.0048588 0.1469592 -0.0517239 0.1080744 -0.0660968 0.0435652 -0.0695457 0.0827455 0.0443843 0.069821 -0.0132063 0.0719468 -0.0375337 0.0622013 0.0702676 0.0643412 -0.0119172 -0.1449421 0.0181991 -0.0139044 0.0424977 -0.0257744 0.0821271 0.0276949 0.1340756 0.0314193 -0.1172053 0.0781235 -0.0344772 0.0029609 -0.0638933 -0.0901347 -0.119303 -0.0203054 -0.1113895 0.0167618 -0.0165408 0.0803532 -0.0505952 0.1303098 -0.0649152 0.1014779 -0.0655522 0.087399 0.0445121 0.005689 -0.0084548 0.1440077 0.0070375 0.0792758 0.0130765 0.0947951 0.0270775 -0.058503 0.1092373 -0.0014654 -0.0068414 0.007505 -0.0608756 -0.0450478 -0.0040011 -0.1006233 0.0447514 -0.1221452 -0.0255328 -0.1106772 -0.0471524 0.0658193 -0.0103991 -0.0756152 0.0064224 0.06043 0.3780592 0.0125261 0.0324422 0.0004994 0.2530052 -0.0946766 0.0145165 -0.1484573 0.1602324 0.2456979 0.0533063 0.1220686 0.1108559 0.3111032 -0.0559634 0.1234456 -0.0153253 0.2165021 unknown
polarizability: 98.0340234|-4.145456|103.6075775|-2.2983933|-2.5633504|91.1104987 unknown
InChI: InChI=1S/C8H14O4/c1-4(2)6(8(11)12)5(3)7(9)10/h4-6,9,11H,1-3H3
charge 0 multiplicity 1
26 atoms
O  -1.150811 -2.400872 0.353168
O  1.688645 1.543818 -0.945321
O  -0.438949 -1.343908 -1.584726
O  2.629162 -0.559183 -0.682979
C  -0.615747 -0.035413 0.511967
C  -1.335181 1.16239 -0.1914
C  0.891511 0.207241 0.918469
C  -1.197031 2.474129 0.614862
C  -2.831553 0.819366 -0.40383
C  1.406976 -0.877378 1.888728
C  -0.710705 -1.27893 -0.365398
C  1.817447 0.305477 -0.293075
H  -1.146894 -0.252651 1.458329
H  -0.863938 1.307277 -1.181215
H  0.91486 1.190608 1.421473
H  -0.160858 2.853145 0.612358
H  -1.832384 3.258438 0.164241
H  -1.527136 2.341199 1.664102
H  -3.344131 0.656123 0.563906
H  -2.963846 -0.087732 -1.021021
H  -3.344396 1.649848 -0.921828
H  0.74849 -0.94229 2.772726
H  1.438598 -1.867336 1.405133
H  2.429568 -0.641224 2.230505
H  -1.17662 -3.18848 -0.257675
H  2.281022 1.548538 -1.7461
