program: Gaussian 09
title: 000223373
version: EM64L-G09RevD.01
frameworkgroup: C1[X(C8H7NO5)]
method: RPBEPBE
basis: SDD
operation: Freq
keyword: #pfreq=noraman
keyword: PBEPBE/SDD
title: #p freq=noraman PBEPBE/SDD
converged: YES YES NO NO
title: Mulliken charges:
elementType: O O O O O N C C C C C C C C H H H H H H H
charge: -0.445458 -0.402222 -0.227323 -0.205985 -0.198319 0.019959 0.412187 -0.266241 -0.496254 -0.355796 0.390690 -0.185046 -0.371680 0.165218 0.277069 0.322978 0.266143 0.241226 0.290381 0.372876 0.395597
chargesum: 0.00000
title: Mulliken charges with hydrogens summed into heavy atoms:
elementType: O O O O O N C C C C C C C C
charge: -0.072582 -0.006626 -0.227323 -0.205985 -0.198319 0.019959 0.412187 0.010828 -0.173276 -0.089653 0.390690 0.056181 -0.081299 0.165218
polarizability: 1.46752613e+02 -3.35986160e+00 1.26227826e+02 -5.12966007e+00 2.12857594e+00 5.93734001e+01
1716.lowfreq: -2.7960 -0.0014 -0.0012 -0.0008 3.9472 6.8326 20.1533 50.4535 58.2968
frequency: 20.0455 50.4521 58.2944 108.7747 138.2447 163.9026 216.4821 264.9890 289.5175 352.0738 375.1623 390.2773 427.0683 440.0138 494.8652 503.4633 561.0532 601.1223 630.6635 652.4643 673.3052 701.7270 709.7697 777.2869 812.4302 853.3629 914.0773 945.8891 969.6093 989.4494 1001.6118 1017.7149 1066.8368 1082.3268 1093.2458 1176.2365 1180.1281 1211.4262 1220.1196 1262.8777 1293.3582 1299.8068 1371.3382 1374.6223 1403.4338 1432.6432 1473.5829 1591.6688 1614.2296 1650.4117 3025.3799 3145.4202 3164.2112 3188.0025 3191.3912 3469.8476 3511.1830
redmass: 7.1228 13.7867 11.3831 5.9442 9.4079 5.7161 4.9577 7.4351 6.5174 3.5086 1.9077 3.3151 3.5301 3.4897 4.6858 5.5180 2.9429 3.0873 2.4930 5.9320 3.7265 2.7661 7.1537 5.8951 1.8150 2.9523 4.3540 1.4795 1.4396 5.6119 1.3613 5.0187 2.1434 1.8133 1.6863 2.1343 1.3840 1.4761 4.9478 1.3741 1.5235 1.5641 1.8272 6.6202 4.9739 2.7123 2.6380 6.9194 6.9479 8.9359 1.0840 1.0879 1.0945 1.0959 1.0920 1.0653 1.0642
irintensity: 0.0400 0.8052 1.4207 0.3064 2.2000 0.9594 4.2062 9.3934 11.6638 46.1680 56.9782 38.0638 6.6200 8.4897 1.8686 4.2689 33.9315 77.1247 78.2128 40.3004 22.8446 37.6719 4.2015 23.3683 39.0700 25.8946 3.3457 0.9389 20.1346 0.5605 1.6405 188.2270 96.1745 49.2368 28.3557 22.1280 19.2316 79.0827 198.0745 10.4702 22.3557 35.4849 61.5811 67.9963 5.1852 19.8970 47.4536 4.2312 13.1635 208.4060 8.2172 3.7960 7.3625 2.1976 11.4764 47.8574 38.7327
temp: 298.150 k
press: 1.00000 atm
elementType: 8 8 8 8 8 7 6 6 6 6 6 6 6 6 1 1 1 1 1 1 1
symmnumber: 1
zpe: 380405.9 jmol-1
zpe.correction: 0.144889 hartree
zpe.thermalcorrener: 0.157391 hartree
zpe.thermalcorrenthalpy: 0.158336 hartree
zpe.thermalcorrgfe: 0.104154 hartree
zpe.sumelectzpe: -738.816801 hartree
zpe.sumelectthermal: -738.804299 hartree
zpe.sumelectthermalent: -738.803355 hartree
zpe.sumelectthermalfe: -738.857536 hartree
dipole: -5.0702 4.9145 -0.3634
dipole: 7.0705
quadrupole: -88.0004 -77.8793 -81.9395
quadrupole: 0.2741 4.1021 -0.6984
quadrupole: -5.3940 4.7271 0.6669 0.2741 4.1021 -0.6984
hfenergy: -738.9616904 hartree
pointgroup: C01 [X(C8H7N1O5)]
dipole: 1.6893725 -1.7794039 -1.3106762 debye
dipolederiv: -0.6596052 -0.0471278 -0.1071238 -0.1531315 -0.4760306 -0.1824689 -0.1856125 -0.219954 -0.4291193 -0.5306794 0.2536211 0.1019758 0.2245288 -0.7904907 -0.3598606 0.164436 -0.419249 -0.5727723 -0.5263341 -0.2028295 0.124894 -0.2358899 -0.8708882 -0.0839085 0.328467 0.1378815 -0.5077503 -0.9073072 0.0033377 -0.0742613 0.0634413 -0.4225308 -0.1041894 -0.0631939 -0.10538 -0.2967531 -0.508936 0.0609934 0.0019527 0.0586393 -0.6912114 -0.2637958 -0.0103857 -0.2474035 -0.3635872 1.4521996 -0.2997502 -0.0139591 -0.3832327 1.0698716 0.456612 -0.0316323 0.4382545 0.4333704 0.3190291 0.110871 0.0080158 0.1236183 -0.1708691 -0.0890345 0.2003471 -0.0386063 -0.1815503 0.1598611 -0.0256663 0.243021 0.1104003 0.3980019 0.2434333 0.2888217 0.1402724 0.2422291 -0.0803452 -0.1995344 -0.0691355 -0.0099674 -0.0673438 0.0233788 0.021388 0.0068304 -0.062615 0.0029914 -0.0916372 -0.0189275 -0.0747334 0.0018753 0.0701051 -0.0303872 0.0737648 -0.065717 -0.2538602 0.2467347 0.105377 0.3179828 -0.1638917 -0.0939452 0.1133454 -0.0933056 0.030869 -0.2306984 0.0776913 0.0379347 0.0798884 0.0923642 0.1269743 0.0269734 0.1360205 -0.0573765 -0.0212731 0.0301057 0.042366 -0.2206096 -0.0006674 0.0392782 -0.1060721 0.0647468 -0.0825764 0.7045992 0.0992665 -0.4060192 0.1334167 1.3299302 0.2332742 -0.7725713 0.0970411 0.7666523 0.0030485 0.0295855 -0.0323328 0.0258656 -0.0537925 0.0010573 -0.0425067 0.0070687 0.0591113 0.1984024 0.0080988 0.0015594 -0.0165002 0.1061764 -0.0258328 0.0079225 -0.0287066 0.1498674 0.039276 0.0874816 0.0154525 0.0817363 0.0787002 -0.0385316 0.0234499 -0.0369523 0.1236371 0.0656515 -0.0243866 -0.0224458 -0.0215076 -0.0291476 -0.1015229 -0.0295602 -0.1061867 0.0943801 0.0441755 -0.0320168 -0.0377784 -0.0048845 0.1418554 -0.0187937 -0.0214759 -0.0208219 0.1591261 0.3816177 -0.0144337 0.0076153 0.0206621 0.253819 0.0747137 0.0304137 0.1533067 0.3008437 0.3481869 -0.0704047 0.0918191 -0.1197231 0.2642695 0.0930569 0.0878332 0.0613784 0.2597308 unknown
polarizability: 145.663091|-5.0151837|112.7681161|-3.8438896|28.2883829|73.9226318 unknown
InChI: InChI=1S/C8H7NO5/c10-7(8(11)12)5-2-1-3-6(4-5)9(13)14/h1-4,7,10-11H
charge 0 multiplicity 1
21 atoms
O  2.122778 0.884241 1.620063
O  3.241353 -1.060173 -1.261254
O  3.33996 1.220474 -0.805163
O  -4.036213 0.595864 0.237158
O  -2.533197 1.998173 1.223037
N  -2.835413 0.917325 0.587209
C  0.626115 -0.574894 0.279228
C  2.068492 -0.241479 0.710173
C  -0.418317 0.307077 0.622047
C  0.335862 -1.767878 -0.43085
C  -1.733741 -0.017055 0.230819
C  -0.992189 -2.073102 -0.804613
C  -2.046914 -1.195636 -0.478183
C  2.942297 0.069859 -0.517593
H  2.502159 -1.117023 1.227275
H  -0.2165 1.21161 1.200137
H  1.148481 -2.452281 -0.696837
H  -1.205014 -2.998054 -1.349848
H  -3.0843 -1.403196 -0.752362
H  2.455601 1.678832 1.118085
H  3.786297 -0.818384 -2.058928
