program: Gaussian 09
title: 000223332
version: EM64L-G09RevD.01
frameworkgroup: C1[X(C4H4ClN3)]
method: RPBEPBE
basis: SDD
operation: Freq
keyword: #p
keyword: freq=noraman
keyword: PBEPBE/SDD
title: #p freq=noraman PBEPBE/SDD
converged: NO NO NO NO
title: Mulliken charges:
elementType: Cl N N N C C C C H H H H
charge: -0.025443 -0.006274 -0.056579 -0.582615 0.015719 -0.151686 -0.141894 -0.240009 0.260056 0.249363 0.339990 0.339372
chargesum: 0.00000
title: Mulliken charges with hydrogens summed into heavy atoms:
elementType: Cl N N N C C C C
charge: -0.025443 -0.006274 -0.056579 0.096748 0.015719 0.108370 -0.141894 0.009354
polarizability: 1.06135523e+02 4.90685970e+00 7.97284323e+01 8.54687936e-03 2.95965054e-03 2.86793913e+01
1716.lowfreq: -0.0013 0.0019 0.0021 2.1043 11.9802 13.7920 157.4113 188.1063 240.1636
frequency: 157.4067 188.1057 240.1636 371.3875 421.8154 444.9281 505.1957 546.5254 566.1928 634.0796 686.7258 781.9878 807.1807 869.4710 947.3241 956.3350 984.0004 1101.0858 1162.2095 1279.9766 1318.1791 1396.3387 1479.4209 1493.7248 1562.2609 1613.1520 3149.9106 3209.7107 3556.5833 3715.3977
redmass: 7.1638 5.8333 5.9570 13.4429 3.1656 3.2421 1.2669 1.0273 7.3577 6.3040 8.3220 6.4153 1.3509 7.7540 6.0614 1.4012 1.9812 1.6781 2.3823 6.7219 1.9019 2.1014 3.1283 5.5284 4.1988 1.7415 1.0921 1.0967 1.0443 1.1061
irintensity: 2.3173 11.7292 2.0760 16.6159 9.1035 25.7096 298.5026 0.8894 3.2819 8.1698 31.1302 5.1607 54.3056 26.2193 22.6625 0.4733 20.9116 12.0349 58.9572 3.3698 26.1260 78.9858 69.7934 222.3341 236.6026 548.2456 15.4895 0.8046 126.8315 56.6341
temp: 298.150 k
press: 1.00000 atm
elementType: 17 7 7 7 6 6 6 6 1 1 1 1
symmnumber: 1
zpe: 216205.7 jmol-1
zpe.correction: 0.082348 hartree
zpe.thermalcorrener: 0.089079 hartree
zpe.thermalcorrenthalpy: 0.090023 hartree
zpe.thermalcorrgfe: 0.050937 hartree
zpe.sumelectzpe: -778.566659 hartree
zpe.sumelectthermal: -778.559929 hartree
zpe.sumelectthermalent: -778.558985 hartree
zpe.sumelectthermalfe: -778.598071 hartree
dipole: -2.1193 0.3844 0.0004
dipole: 2.1538
quadrupole: -50.1114 -45.6367 -55.1855
quadrupole: 9.0792 -0.0018 0.0007
quadrupole: 0.1998 4.6745 -4.8743 9.0792 -0.0018 0.0007
hfenergy: -778.6490078 hartree
pointgroup: C01 [X(C4H4Cl1N3)]
dipole: 0.8081729 0.2547908 -0.0001558 debye
dipolederiv: -0.884116 -0.264112 -0.0001328 -0.3622138 -0.2551132 -0.0000698 0.0000494 0.0001245 -0.0985604 -1.405351 0.3625997 0.0000975 0.182487 -0.4691942 0.0003205 -0.0006632 -0.0000144 -0.1849824 -0.7101037 -0.041433 -0.0002628 0.6641741 -0.7477464 -0.0001871 0.00001 0.00018 -0.2437305 -1.1040091 0.6490479 -0.0001305 0.7187821 -0.6448267 0.0001459 0.0014943 -0.0010204 -0.7220264 1.565101 -0.7421717 -0.0003668 -0.8809952 0.9281137 0.0002234 -0.0012434 0.001019 0.2293588 -0.6546159 -0.2686957 -0.0001149 -0.3774207 -0.5630509 -0.0000842 -0.0000886 -0.0000247 -0.1207686 1.7368998 0.1563081 0.0003693 0.3257716 0.9310101 -0.0000491 0.0003956 -0.0002241 0.0535282 0.8649484 0.1829336 0.0003039 -0.2374519 0.4269051 -0.0001698 0.0002393 -0.0000379 -0.0296878 0.0247158 0.0724981 -0.0000777 0.0576935 0.0622831 0.0000362 0.0000283 0.0000189 0.1980246 0.0818495 -0.0308504 0.0000404 0.0004195 -0.0907696 0.0000588 -0.0001759 -0.0000188 0.1230074 0.1927973 -0.0305238 0.0001951 -0.0882195 0.2576996 -0.0000355 0.0000242 0.0000699 0.3994368 0.2918838 -0.0456008 0.0000794 -0.0030268 0.1646892 -0.0001895 -0.00007 -0.0000719 0.3964003 unknown
polarizability: 106.9418811|-1.4606441|78.9220739|0.008851|-0.0018624|28.6793913 unknown
InChI: InChI=1S/C4H4ClN3/c5-3-1-2-7-4(6)8-3/h1-2H,6H2
charge 0 multiplicity 1
12 atoms
Cl -2.790108 -0.984215 -0.000191
N  -0.083579 -1.026505 0.000782
N  1.386075 0.934569 0.0008
N  2.250364 -1.250043 -0.000095
C  1.157572 -0.423168 0.00178
C  -1.048364 1.203606 -0.000134
C  -1.137116 -0.205367 -0.000151
C  0.272212 1.717179 0.000071
H  -1.926005 1.850052 -0.000409
H  0.446764 2.798274 -0.000063
H  2.111913 -2.257292 -0.000227
H  3.179673 -0.837489 -0.000164
