program: Gaussian 09
title: 000223327
version: EM64L-G09RevD.01
frameworkgroup: C1[X(C12H7IO)]
method: RPBEPBE
basis: SDD
operation: Freq
keyword: #p
keyword: freq=noraman
keyword: PBEPBE/SDD
title: #p freq=noraman PBEPBE/SDD
converged: NO NO NO NO
title: Mulliken charges:
elementType: I O C C C C C C C C C C C C H H H H H H H
charge: 0.095689 -0.259058 0.209614 0.195485 0.179588 0.177320 -0.303149 -0.381256 -0.339078 -0.351396 -0.370358 -0.238114 -0.140690 -0.213328 0.261316 0.242933 0.262930 0.258002 0.251515 0.229319 0.232714
chargesum: 0.00000
title: Mulliken charges with hydrogens summed into heavy atoms:
elementType: I O C C C C C C C C C C C C
charge: 0.095689 -0.259058 0.209614 0.195485 0.179588 0.177320 -0.041833 -0.138323 -0.076148 -0.093394 -0.370358 -0.008795 0.110825 0.019387
polarizability: 2.72693582e+02 -1.09539490e+01 1.51135538e+02 7.89144555e-03 8.00748251e-03 5.27057532e+01
1716.lowfreq: -4.8151 -0.0005 0.0005 0.0005 1.7955 6.8857 67.1107 105.6227 120.0816
frequency: 67.0690 105.6209 120.0796 187.3964 209.7555 261.5681 290.8667 344.4463 421.9501 438.6411 442.3646 517.3982 552.8888 575.0963 583.6593 614.9262 660.4141 720.7211 748.4885 753.5006 769.3291 809.6041 818.5827 824.1597 863.1649 889.4593 943.9889 946.0039 981.9334 992.6924 1015.0136 1040.6681 1095.5103 1117.9132 1158.9071 1177.3065 1184.8350 1235.1153 1264.7029 1293.2803 1373.0855 1398.8183 1409.0310 1432.1903 1446.6323 1473.8855 1573.6133 1600.1241 1601.2137 1639.4071 3135.6236 3147.7303 3162.0768 3164.1823 3164.2601 3178.6356 3183.3602
redmass: 5.7255 7.9386 4.8463 4.8019 13.6324 5.2552 4.9651 7.8267 3.0282 6.5228 2.9524 4.9335 4.0293 8.6978 4.0316 7.2772 7.9806 4.1762 6.1241 1.9230 1.9976 1.4101 6.9230 7.4724 1.3874 1.4792 1.3855 1.3452 1.3129 6.0978 2.1640 2.0308 2.1974 1.8310 1.4326 1.7169 2.0672 2.6888 1.3047 1.6524 5.8779 3.5636 3.7949 3.1869 2.7200 3.4287 8.0847 7.1269 7.9948 8.4472 1.0859 1.0911 1.0933 1.0945 1.0908 1.0985 1.0976
irintensity: 0.2123 0.2269 2.1568 0.0032 0.1974 1.1819 0.0098 2.7130 9.6575 3.8852 0.0002 0.6658 7.8644 19.8796 8.9095 2.3599 18.5182 3.1922 5.2111 51.1257 44.7516 60.0759 8.2598 21.3336 0.0002 13.8292 3.5814 0.3011 0.0137 29.9879 34.5018 8.8299 17.3815 30.9079 31.2025 41.0277 48.4479 6.1559 15.0483 1.2098 14.9141 9.3438 25.9877 59.5837 72.6122 0.1407 8.0564 2.6923 1.1145 7.2074 0.6749 10.0211 0.4119 17.1871 4.8704 13.0939 3.3828
temp: 298.150 k
press: 1.00000 atm
elementType: 53 8 6 6 6 6 6 6 6 6 6 6 6 6 1 1 1 1 1 1 1
symmnumber: 1
zpe: 395502.7 jmol-1
zpe.correction: 0.150639 hartree
zpe.thermalcorrener: 0.161096 hartree
zpe.thermalcorrenthalpy: 0.162040 hartree
zpe.thermalcorrgfe: 0.112639 hartree
zpe.sumelectzpe: -547.270786 hartree
zpe.sumelectthermal: -547.260329 hartree
zpe.sumelectthermalent: -547.259385 hartree
zpe.sumelectthermalfe: -547.308786 hartree
dipole: 1.6851 -0.5310 0.0000
dipole: 1.7668
quadrupole: -84.2931 -85.1111 -100.9641
quadrupole: -5.1620 0.0006 0.0011
quadrupole: 5.8297 5.0117 -10.8413 -5.1620 0.0006 0.0011
hfenergy: -547.4214249 hartree
pointgroup: C01 [X(C12H7I1O1)]
dipole: 0.6923101 0.0622237 -0.0000073 debye
dipolederiv: -0.4103401 0.1886162 0.0000142 0.2693283 -0.1543221 -0.000017 -0.0002014 0.0000992 -0.0053514 -1.3253541 -0.0371557 0.0000273 -0.0906949 -0.5046517 -0.000034 0.000128 -0.0001034 -0.1514126 0.1938115 -0.0792012 -0.0000202 0.2317603 -0.0795546 -0.0000045 0.0000118 -0.0000553 0.0153466 0.1023536 0.1868682 0.0000028 -0.1329898 -0.152264 -0.0000046 -0.0000548 -0.0000123 -0.0005682 0.7455233 -0.2022608 -0.0000749 -0.6968764 0.1393696 -0.0000026 -0.0002685 0.000133 0.0735213 0.4706812 0.2489822 0.0000179 0.6835636 0.3621156 0.0000175 0.0001789 -0.0000144 0.0696472 -0.2339492 0.1333399 0.0000624 0.2279534 -0.0437739 0.0000503 0.0001252 -0.0000082 -0.0930972 0.1057981 -0.0694754 -0.0000224 0.0857246 0.0939396 0.0000208 -0.0000269 0.0000284 -0.1420146 0.0168306 0.0634859 0.0000365 0.1312775 0.0449446 0.0000148 0.0000352 0.0000006 -0.1535385 -0.0561058 -0.1452874 -0.0000198 -0.1090618 0.0034832 0.0000149 -0.0001413 0.0000834 -0.1666931 0.8397319 -0.5654972 -0.0000881 -0.7955941 0.2561833 0.0000424 0.0001483 -0.0000762 -0.1714659 -0.1794422 0.1110665 0.0000009 0.1830917 0.0218046 0.0000059 0.000082 -0.0000002 -0.1694363 -0.4089326 0.1956822 0.0000102 0.1991985 -0.0354284 -0.000005 -0.0000406 0.0000269 -0.1167709 0.0040684 -0.0034167 -0.000011 -0.1348241 0.0667934 0.0000314 0.0000039 0.0000145 -0.1639215 0.1064178 -0.0312132 -0.0000077 -0.0067841 -0.0313454 -0.0000453 -0.0000327 -0.0000132 0.1585149 0.0612606 0.0875573 0.0000154 0.0420497 -0.0477276 -0.0000221 0.0000016 -0.0000174 0.1574448 0.068268 0.0223494 0.0000085 -0.0075063 -0.04266 -0.0000156 0.0000168 -0.0000299 0.1835154 0.0712811 0.0368422 0.0000104 0.073091 -0.0278711 -0.0000259 0.0000055 -0.0000277 0.1825991 -0.0305894 -0.0683388 0.0000017 -0.0470098 0.0842681 -0.0000036 0.0000237 0.0000022 0.1644494 -0.0114872 -0.0938397 0.0000102 -0.1166442 -0.0438694 -0.0000073 0.0000195 -0.0000265 0.1660596 -0.1298257 0.0208961 0.0000257 0.0109469 0.0905663 -0.0000106 -0.0000142 -0.0000035 0.1631718 unknown
polarizability: 271.7070037|-15.4577533|152.1221154|-0.0059952|0.0095106|52.7057532 unknown
InChI: InChI=1S/C12H7IO/c13-8-5-6-12-10(7-8)9-3-1-2-4-11(9)14-12/h1-7H
charge 0 multiplicity 1
21 atoms
I  -4.644766 1.670802 0.000342
O  0.641136 -1.808851 -0.000195
C  -0.453562 0.267618 0.000087
C  0.986883 0.516196 0.000042
C  -0.611965 -1.150961 -0.000057
C  1.608588 -0.768779 -0.000133
C  -1.603992 1.089583 0.000205
C  1.804316 1.669948 0.000138
C  -1.857666 -1.788844 -0.000065
C  2.994761 -0.962451 -0.000224
C  -2.864618 0.454959 0.000193
C  3.207257 1.502433 0.000048
C  -3.00395 -0.9583 0.000067
C  3.793437 0.206442 -0.000128
H  -1.520814 2.18005 0.000325
H  1.364983 2.673203 0.000268
H  -1.94515 -2.878271 -0.000164
H  3.431543 -1.964636 -0.000358
H  -3.998213 -1.413098 0.000082
H  3.856702 2.384167 0.000119
H  4.88429 0.108091 -0.000193
