program: Gaussian 09
title: 000223326
version: EM64L-G09RevD.01
frameworkgroup: C1[X(C6H4Br2O2)]
method: RPBEPBE
basis: SDD
operation: Freq
keyword: #p
keyword: freq=noraman
keyword: PBEPBE/SDD
title: #p freq=noraman PBEPBE/SDD
converged: NO NO NO NO
title: Mulliken charges:
elementType: Br Br O O C C C C C C H H H H
charge: 0.058229 0.053002 -0.421008 -0.477227 0.180730 0.178199 -0.270709 -0.278219 -0.166307 -0.162009 0.283209 0.253208 0.388439 0.380461
chargesum: 0.00000
title: Mulliken charges with hydrogens summed into heavy atoms:
elementType: Br Br O O C C C C C C
charge: 0.058229 0.053002 -0.032569 -0.096766 0.180730 0.178199 0.012500 -0.025011 -0.166307 -0.162009
polarizability: 1.55129921e+02 -8.76814983e-01 1.14354841e+02 -5.45619535e-05 7.55218815e-04 3.80215860e+01
1716.lowfreq: 0.0003 0.0003 0.0005 1.0860 5.3505 6.4608 76.4746 121.8672 135.3252
frequency: 76.4655 121.8672 135.3117 189.9660 236.4246 267.4895 269.9157 286.4540 307.7236 356.7436 431.4840 463.6408 491.1843 599.9801 605.4857 628.3748 685.4417 776.2578 820.4855 865.0785 871.6920 1080.3857 1093.8870 1162.7294 1193.7535 1259.0322 1284.9558 1380.3391 1389.2478 1490.4089 1590.9027 1608.6531 3147.5404 3185.3424 3542.7346 3628.9751
redmass: 8.0052 55.9564 7.9950 13.6947 5.9345 1.1065 5.7704 9.9227 11.1612 11.3979 2.6806 1.1405 5.4491 6.4749 9.2628 7.7880 3.6271 5.7951 1.4691 1.4214 10.7364 1.9785 2.0920 1.4597 1.5803 1.9473 3.1432 6.5629 2.9005 3.8473 7.4736 7.0333 1.0921 1.0926 1.0650 1.0668
irintensity: 1.9923 0.1297 2.0133 1.8972 9.7976 168.1672 5.5862 3.4836 1.9841 2.1629 50.9375 116.8440 12.4421 31.0727 0.3937 28.7505 0.5034 39.6074 17.5592 34.8614 18.9448 238.4847 20.7026 60.9266 155.1748 149.2949 38.7174 10.3151 110.2078 178.2196 26.5894 0.6377 3.9160 0.7012 102.6355 73.8829
temp: 298.150 k
press: 1.00000 atm
elementType: 35 35 8 8 6 6 6 6 6 6 1 1 1 1
symmnumber: 1
zpe: 224457.4 jmol-1
zpe.correction: 0.085491 hartree
zpe.thermalcorrener: 0.095438 hartree
zpe.thermalcorrenthalpy: 0.096383 hartree
zpe.thermalcorrgfe: 0.048322 hartree
zpe.sumelectzpe: -407.663350 hartree
zpe.sumelectthermal: -407.653403 hartree
zpe.sumelectthermalent: -407.652459 hartree
zpe.sumelectthermalfe: -407.700519 hartree
dipole: -2.9244 2.9496 0.0003
dipole: 4.1536
quadrupole: -67.6609 -69.0315 -79.4759
quadrupole: -10.8644 -0.0010 0.0012
quadrupole: 4.3952 3.0246 -7.4198 -10.8644 -0.0010 0.0012
hfenergy: -407.7488414 hartree
pointgroup: C01 [X(C6H4Br2O2)]
dipole: -1.1279113 -1.1824643 -0.0004149 debye
dipolederiv: -0.3802563 -0.2831658 -0.0000731 -0.2972408 -0.2115707 -0.0000562 -0.000072 -0.0000537 0.0020902 -0.400026 0.2625682 0.0000553 0.3015462 -0.2010974 -0.000043 0.0000637 -0.0000452 0.0003261 -1.3546113 0.4836519 0.0000939 0.5545494 -0.361804 -0.0000087 0.0000899 0.0000079 -0.410857 -1.2270398 -0.5726885 -0.0001988 -0.6380304 -0.483205 0.0000482 -0.0001319 0.0000893 -0.4356966 1.1528789 -0.4817236 -0.0000968 -0.7667629 0.2151082 0.0000348 -0.0001896 0.0000264 0.0776246 0.8487777 0.5461086 0.0001655 0.8762403 0.3147983 0.0000632 0.000214 0.0000427 0.0320149 -0.3420686 0.0317649 0.0000075 -0.1675057 -0.0757547 0.0000033 -0.0000367 0.0000017 -0.1031302 -0.2625365 0.0111875 -0.0000016 0.1184223 -0.1125407 -0.0000002 0.0000368 0.0000097 -0.1088246 0.5327501 0.6501251 0.0001571 0.5523759 0.3464046 0.00012 0.0001283 0.0001211 -0.1087157 0.4733852 -0.6661593 -0.0001467 -0.5612428 0.2177358 0.0000679 -0.0001141 0.000066 -0.1106435 0.0911318 0.0217777 0.000003 0.0097212 0.0096459 -0.0000418 0.0000041 -0.0000418 0.1750608 0.0646208 -0.0427585 -0.0000145 -0.0365386 -0.0546931 -0.0000591 -0.0000141 -0.0000574 0.1779186 0.4382707 -0.1193178 -0.0000267 -0.0879638 0.2125319 -0.0000215 -0.0000044 -0.0000366 0.3983009 0.3647232 0.1586294 0.0000759 0.1424295 0.184441 -0.0001068 0.0000261 -0.0001301 0.4145315 unknown
polarizability: 155.0808278|1.6637798|114.403929|0.0021823|0.019565|38.0215911 unknown
InChI: InChI=1S/C6H4Br2O2/c7-3-1-5(9)6(10)2-4(3)8/h1-2,9-10H
charge 0 multiplicity 1
14 atoms
Br 2.785495 1.779443 0.000447
Br 2.836242 -1.72757 -0.0004
O  -2.500899 1.37424 0.000278
O  -2.539741 -1.332859 -0.000379
C  -1.292852 0.686315 0.000133
C  -1.266003 -0.735554 -0.000238
C  -0.08284 1.402419 0.00034
C  -0.04258 -1.426269 -0.000383
C  1.15165 0.71155 0.000175
C  1.174504 -0.701545 -0.000184
H  -0.117727 2.494353 0.000615
H  -0.018622 -2.521416 -0.000649
H  -3.248792 0.721891 0.000186
H  -2.501135 -2.318398 -0.00084
