program: Gaussian 09
title: 000223312
version: EM64L-G09RevD.01
frameworkgroup: C1[X(C18H24N2O2)]
method: RPBEPBE
basis: SDD
operation: Freq
keyword: #p
keyword: freq=noraman
keyword: PBEPBE/SDD
title: #p freq=noraman PBEPBE/SDD
converged: NO YES NO NO
title: Mulliken charges:
elementType: O O N N C C C C C C C C C C C C C C C C C C H H H H H H H H H H H H H H H H H H H H H H H H
charge: -0.475166 -0.475156 -0.702383 -0.702379 -0.248917 -0.248878 -0.420270 -0.420034 0.646008 0.646297 -0.712583 -0.712561 -0.638300 -0.638627 -0.459051 -0.459084 0.370141 0.370202 -0.368800 -0.368779 0.093208 0.093179 0.208168 0.208285 0.196191 0.210749 0.210675 0.196240 0.241722 0.205069 0.207136 0.205057 0.207132 0.241712 0.224822 0.224785 0.224134 0.224190 0.205587 0.205601 0.301031 0.334601 0.301038 0.334611 0.356696 0.356700
chargesum: 0.00000
title: Mulliken charges with hydrogens summed into heavy atoms:
elementType: O O N N C C C C C C C C C C C C C C C C C C
charge: -0.118470 -0.118456 -0.066751 -0.066730 -0.040749 -0.040593 -0.013330 -0.013119 0.646008 0.646297 -0.058656 -0.058659 -0.413479 -0.413842 -0.234917 -0.234894 0.370141 0.370202 -0.163213 -0.163178 0.093208 0.093179
polarizability: 1.99302065e+02 1.87759469e-01 2.52867458e+02 2.01774603e+01 -1.88347973e-02 1.96863644e+02
1716.lowfreq: -15.1326 -12.3125 -0.0005 0.0001 0.0004 4.9071 17.8477 21.3350 23.5068
frequency: 16.7043 21.3243 22.3786 48.0182 61.7152 73.4499 123.7696 135.7140 141.9917 170.7064 172.3252 175.3346 188.1922 226.1022 226.3305 235.4627 242.4274 280.7191 281.6702 290.2677 296.7336 302.9840 315.0599 329.2378 348.7477 366.8302 397.1670 397.4583 429.8999 430.7191 439.3123 454.4146 471.2334 475.3926 511.8011 551.7729 561.2371 576.2697 590.5189 631.9265 654.0778 704.6496 708.0540 733.9326 734.7118 755.4510 756.1156 774.6171 779.5457 801.4308 823.9877 861.6504 863.8026 872.7311 888.4714 888.9742 913.5136 947.5517 951.6952 995.9419 1023.1510 1031.6735 1032.4380 1055.0200 1073.5487 1088.2465 1088.9399 1091.5347 1098.0523 1109.7383 1155.2999 1155.7413 1177.2254 1182.9579 1218.1294 1232.2031 1232.3808 1244.0344 1244.1466 1295.4487 1300.7929 1302.0278 1316.8053 1320.3620 1325.2639 1328.6108 1331.1152 1334.1615 1386.6360 1387.0182 1412.2960 1413.0866 1451.7185 1452.5327 1468.4103 1468.9305 1470.3650 1470.5922 1485.5947 1485.8765 1517.0297 1517.5675 1607.9478 1608.3475 1612.9203 1612.9393 1636.4911 1638.5702 2952.5687 2962.9483 2971.2885 2973.0362 2973.8752 2975.8433 3027.0006 3033.4462 3062.9273 3063.0337 3083.1307 3083.9514 3101.3414 3101.4408 3115.1787 3115.8927 3138.4236 3138.5357 3568.0209 3568.2597 3608.2899 3608.3899 3715.8045 3715.8381
redmass: 4.6027 5.3702 4.0763 3.7905 4.5429 2.5844 2.0163 3.8455 2.2627 3.8185 2.1700 2.2201 4.5782 1.6265 3.3520 1.4827 2.6193 1.1286 1.1736 3.6624 3.5282 4.0402 1.5290 1.4324 2.5842 2.8046 3.4334 3.7527 3.6237 2.8934 2.5877 2.5565 1.2503 1.1472 3.5442 3.7488 4.7245 5.6291 4.0205 3.8930 3.1590 2.8906 2.4424 3.0098 2.9871 5.2028 5.2781 1.4616 1.4596 1.4163 1.6102 1.7161 1.7392 1.8706 1.3515 1.3523 2.4359 2.7581 2.0962 4.6242 1.7782 1.7177 1.6787 1.5770 1.9568 2.4052 1.6779 1.7427 2.1486 2.2350 1.2323 1.2077 1.6951 1.5333 1.5419 2.1074 2.1520 1.3000 1.3430 1.3813 1.3895 1.1904 1.9060 2.6626 2.0761 1.3811 1.3758 1.4155 1.2147 1.2113 5.6082 5.4780 3.7686 3.7971 1.0688 1.0654 1.0489 1.0419 1.0644 1.0667 3.6415 3.6952 4.0653 4.3535 1.5901 1.5901 3.4263 3.4788 1.0803 1.0717 1.0623 1.0409 1.0380 1.0695 1.0988 1.0959 1.0994 1.0993 1.0997 1.0993 1.0879 1.0878 1.0910 1.0910 1.0944 1.0945 1.0441 1.0442 1.0662 1.0662 1.1046 1.1046
irintensity: 0.0143 0.0293 0.7340 0.0531 0.9822 0.2117 0.0148 0.0393 0.7747 0.3028 0.0556 0.4011 1.8203 4.8796 7.3105 0.0462 71.0665 32.4348 249.0237 1.7452 18.7239 10.1499 185.1883 42.9645 133.0918 11.4309 2.0901 5.5016 1.7749 12.7206 7.2905 36.5011 83.6648 15.2192 1.6319 4.2261 3.9965 0.0110 1.0107 9.7135 41.7526 5.8371 5.0727 0.0195 2.5189 6.9948 7.3665 17.6902 60.8419 3.6961 7.1459 5.8291 39.5230 13.1588 0.1687 3.1239 15.6818 3.5438 11.8908 0.3209 2.0645 6.0475 1.8867 0.1112 20.2927 9.3747 191.0973 288.4912 32.3215 0.0023 45.5126 16.2466 23.9469 1.7956 2.2148 16.8998 10.4606 2.3388 0.2419 1.6933 1.0150 9.4708 17.8784 108.7715 38.4930 6.8390 0.0245 18.5655 22.0526 1.2210 0.5266 1.7541 25.3467 5.4512 2.3163 8.6746 14.3590 0.4752 15.3142 1.6595 65.4042 177.1033 1.5412 10.0348 20.5751 20.3042 235.9992 252.0003 0.6928 16.9888 21.2324 89.6683 21.1759 27.1934 34.5142 35.9138 38.8270 62.1928 32.7845 71.0832 39.4897 11.1364 1.5400 30.4311 7.7663 14.2698 44.8055 110.1363 45.4658 27.3119 18.1797 43.0608
temp: 298.150 k
press: 1.00000 atm
elementType: 8 8 7 7 6 6 6 6 6 6 6 6 6 6 6 6 6 6 6 6 6 6 1 1 1 1 1 1 1 1 1 1 1 1 1 1 1 1 1 1 1 1 1 1 1 1
symmnumber: 1
zpe: 1008312.0 jmol-1
zpe.correction: 0.384046 hartree
zpe.thermalcorrener: 0.407558 hartree
zpe.thermalcorrenthalpy: 0.408502 hartree
zpe.thermalcorrgfe: 0.330524 hartree
zpe.sumelectzpe: -958.629582 hartree
zpe.sumelectthermal: -958.606070 hartree
zpe.sumelectthermalent: -958.605126 hartree
zpe.sumelectthermalfe: -958.683104 hartree
dipole: -0.0086 -1.6255 0.0028
dipole: 1.6255
quadrupole: -130.8832 -123.6496 -112.1588
quadrupole: 0.0315 13.2390 -0.0147
quadrupole: -8.6526 -1.4190 10.0717 0.0315 13.2390 -0.0147
hfenergy: -959.0136279 hartree
pointgroup: C01 [X(C18H24N2O2)]
dipole: -0.0014395 0.6395339 0.0002994 debye
polarizability: 196.631492|0.0261999|252.8676938|-20.1620425|0.1558747|199.53398 unknown
InChI: InChI=1S/C18H24N2O2/c1-3-13(11-5-7-17(21)15(19)9-11)14(4-2)12-6-8-18(22)16(20)10-12/h5-10,13-14,21-22H,3-4,19-20H2,1-2H3
charge 0 multiplicity 1
46 atoms
O  3.732024 2.803565 -1.025661
O  -3.725858 2.810266 1.039845
N  2.659757 2.590276 1.438065
N  -2.659271 2.60097 -1.426739
C  0.691976 -1.91756 0.37558
C  -0.697257 -1.91275 -0.379325
C  1.49714 -3.234064 0.169533
C  -1.508315 -3.226832 -0.179871
C  1.510945 -0.684233 -0.025317
C  -1.511642 -0.678249 0.026957
C  2.853723 -3.24577 0.906626
C  -2.865238 -3.228588 -0.916367
C  1.710935 0.370712 0.895202
C  -1.71201 0.379094 -0.890699
C  2.068586 -0.572145 -1.324156
C  -2.066246 -0.568305 1.327263
C  2.449442 1.534348 0.555246
C  -2.448278 1.54294 -0.546616
C  2.814698 0.575749 -1.683934
C  -2.809871 0.579879 1.691257
C  3.003338 1.613782 -0.756155
C  -2.999209 1.620196 0.766168
H  0.469243 -1.839297 1.460897
H  -0.473827 -1.830217 -1.464181
H  1.66241 -3.40425 -0.914499
H  0.892932 -4.087641 0.530404
H  -0.908077 -4.081173 -0.545553
H  -1.673958 -3.401953 0.903326
H  3.518371 -2.446596 0.534676
H  2.714959 -3.086281 1.993286
H  3.369307 -4.214912 0.770793
H  -2.726324 -3.063332 -2.00214
H  -3.384693 -4.19639 -0.785868
H  -3.526388 -2.428868 -0.539418
H  1.268345 0.298792 1.897002
H  -1.271802 0.308697 -1.893659
H  1.935447 -1.375786 -2.05694
H  -1.932743 -1.373876 2.057862
H  3.250632 0.656835 -2.689354
H  -3.243486 0.659335 2.69781
H  2.243704 2.587939 2.363357
H  3.187048 3.399187 1.121797
H  -2.245691 2.599843 -2.353141
H  -3.18507 3.409764 -1.107706
H  4.101557 2.785533 -1.941045
H  -4.093667 2.790568 1.955889
