program: Gaussian 09
title: 000223311
version: EM64L-G09RevD.01
frameworkgroup: C1[X(C17H17BrO2)]
method: RPBEPBE
basis: SDD
operation: Freq
keyword: #p
keyword: freq=noraman
keyword: PBEPBE/SDD
title: #p freq=noraman PBEPBE/SDD
converged: YES YES NO NO
title: Mulliken charges:
elementType: Br O O C C C C C C C C C C C C C C C C C H H H H H H H H H H H H H H H H H
charge: 0.011453 -0.213803 -0.420860 -0.136426 -0.444038 -0.438363 -0.400335 -0.399543 -0.385554 0.064240 0.199616 -0.057206 -0.321868 0.308198 0.578845 -0.526715 -0.369885 -0.409326 -0.279582 -0.245440 0.260634 0.229171 0.201155 0.216993 0.218182 0.201235 0.190487 0.191736 0.200149 0.197408 0.193781 0.300449 0.184291 0.261598 0.362591 0.237363 0.239370
chargesum: 0.00000
title: Mulliken charges with hydrogens summed into heavy atoms:
elementType: Br O O C C C C C C C C C C C C C C C C C
charge: 0.011453 -0.213803 -0.058269 0.124208 -0.013711 -0.003188 -0.008613 -0.007659 0.005635 0.064240 0.199616 -0.057206 -0.021419 0.308198 0.578845 -0.526715 -0.185594 -0.147728 -0.042220 -0.006070
polarizability: 2.99995304e+02 -1.78244959e+01 2.41977923e+02 -7.06272295e+00 3.82188902e+00 1.09702914e+02
1716.lowfreq: -18.5530 -6.3911 0.0005 0.0006 0.0006 2.0869 6.3422 33.3361 48.0736
frequency: -14.3174 33.1185 47.9876 83.1877 94.0054 110.1859 127.4941 146.4883 181.8669 195.6617 219.5516 230.6537 269.6406 274.7035 287.3401 335.4351 347.4351 350.8264 381.3716 421.9504 429.1509 436.4067 476.2748 490.1611 502.8817 549.1490 588.3690 608.6506 632.4658 648.1984 706.9922 735.8697 758.3178 767.9557 785.0033 789.0877 792.9709 841.5644 871.0745 874.0594 881.8722 895.3150 897.3801 920.5729 939.5325 953.3245 978.7833 997.6243 1033.2009 1043.9145 1048.0866 1051.7748 1069.2858 1094.3831 1110.4299 1138.1350 1144.5645 1171.8381 1179.9839 1187.7172 1214.4706 1243.6148 1245.1896 1255.0807 1263.2186 1272.1861 1295.1024 1311.0854 1319.8012 1335.2581 1336.6529 1341.9449 1346.1431 1352.6349 1374.7705 1417.4236 1429.6920 1441.3901 1460.3661 1461.7413 1464.4822 1470.7549 1477.9907 1502.2927 1558.8139 1579.0545 1594.8517 1624.6650 2963.0106 2964.5176 2969.5467 2980.5301 2985.8881 3023.3983 3025.9414 3032.2637 3037.6406 3047.8031 3060.8574 3086.0417 3142.4307 3158.0927 3165.5961 3172.8917 3575.8225
redmass: 6.3138 3.2466 4.9840 4.2959 2.7808 7.6858 6.9846 4.1965 5.0066 5.5127 2.5942 2.6513 3.5095 1.6791 3.8675 5.0578 2.8128 6.3073 3.7860 2.6390 3.1071 3.5979 6.6458 3.7381 1.6105 5.7855 3.5437 6.1652 7.2668 5.0996 5.9666 5.0671 1.4448 3.3100 1.8874 2.1916 2.7359 2.5823 1.8229 4.1581 1.6971 1.5776 4.9384 1.8175 1.4878 1.3828 2.9577 1.3482 3.0175 1.9537 2.0067 1.5622 1.2750 3.3187 2.2835 2.0379 1.7625 1.4189 1.3416 1.3028 2.2593 1.4742 1.8569 1.2915 1.3393 1.5666 1.2347 1.3776 1.3596 1.3902 2.6301 1.5409 1.7202 1.5282 2.8234 5.9714 3.4181 2.8060 1.0855 1.0877 1.0902 1.0835 1.0939 3.5356 8.4016 7.9127 6.6324 6.4733 1.0624 1.0608 1.0636 1.0614 1.0624 1.0981 1.0950 1.0911 1.0988 1.1024 1.0979 1.0883 1.0873 1.0930 1.0919 1.0999 1.0651
irintensity: 0.9463 0.2680 0.4342 0.0124 4.8007 0.4184 1.4911 1.3660 2.4347 2.9221 0.1179 1.0569 15.7772 54.7566 5.0655 6.2027 1.0349 3.5406 0.6571 32.3670 0.3414 12.2171 0.1570 1.3890 1.3498 10.2551 3.5088 28.5661 32.5148 5.2214 8.8696 10.4859 96.5925 5.9874 2.5157 1.8683 4.2866 14.0912 5.8745 7.3716 1.0534 11.5477 29.4037 3.7301 12.4586 1.9791 69.0319 0.5099 0.6823 19.1665 3.3795 2.1747 1.2804 77.1844 0.1694 63.2498 50.7370 12.7738 28.2175 16.0261 36.8283 22.1730 23.6264 3.0070 7.1847 66.5794 4.6954 5.3012 11.6224 7.3586 171.5645 14.5352 119.8670 42.5705 37.2127 31.2837 16.9497 11.2775 2.3337 7.9076 13.2744 17.5378 2.5859 1.3117 132.6305 18.7542 16.4969 20.4152 34.5252 33.9532 41.4546 20.1911 24.2294 64.1937 84.5587 14.8256 41.5989 9.7919 72.7558 19.3279 5.9309 9.4423 12.5224 23.1255 31.7124
temp: 298.150 k
press: 1.00000 atm
elementType: 35 8 8 6 6 6 6 6 6 6 6 6 6 6 6 6 6 6 6 6 1 1 1 1 1 1 1 1 1 1 1 1 1 1 1 1 1
symmnumber: 1
zpe: 774846.2 jmol-1
zpe.correction: 0.295123 hartree
zpe.thermalcorrener: 0.312281 hartree
zpe.thermalcorrenthalpy: 0.313225 hartree
zpe.thermalcorrgfe: 0.249468 hartree
zpe.sumelectzpe: -820.483761 hartree
zpe.sumelectthermal: -820.466603 hartree
zpe.sumelectthermalent: -820.465659 hartree
zpe.sumelectthermalfe: -820.529416 hartree
dipole: -0.6645 6.0416 0.8254
dipole: 6.1338
quadrupole: -118.8555 -117.6741 -131.3070
quadrupole: -3.0202 0.2341 -1.9558
quadrupole: 3.7567 4.9381 -8.6948 -3.0202 0.2341 -1.9558
hfenergy: -820.7788842 hartree
pointgroup: C01 [X(C17H17Br1O2)]
dipole: 0.8618157 -1.7883327 1.3721743 debye
polarizability: 305.2727228|0.2701508|203.9323897|3.2827712|-55.9020667|142.4710282 unknown
InChI: InChI=1S/C17H17BrO2/c18-15-10-14(16(19)11-6-2-1-3-7-11)17(20)13-9-5-4-8-12(13)15/h4-5,8-11,20H,1-3,6-7H2
charge 0 multiplicity 1
37 atoms
Br 3.319433 2.980682 -1.751684
O  -1.834118 1.708958 -1.539988
O  -0.21993 -1.482403 0.686017
C  -2.527743 0.176815 0.202681
C  -3.609906 1.194924 0.658799
C  -3.183662 -0.978824 -0.620373
C  -4.725401 0.494753 1.46792
C  -4.304866 -1.67098 0.188121
C  -5.372428 -0.656592 0.66238
C  -1.470955 0.86987 -0.65832
C  0.008966 0.62654 -0.468189
C  0.606624 -0.465444 0.191762
C  0.871728 1.624436 -1.040569
C  2.04498 -0.562538 0.335316
C  2.89475 0.465376 -0.237638
C  2.248175 1.54731 -0.930874
C  2.66628 -1.646611 1.038996
C  4.313166 0.351403 -0.086946
C  4.05396 -1.731473 1.171284
C  4.884592 -0.722266 0.599441
H  -2.049362 -0.272494 1.089962
H  -4.035681 1.686814 -0.235848
H  -3.1401 1.991352 1.268843
H  -2.411116 -1.715517 -0.909645
H  -3.60279 -0.547417 -1.551461
H  -5.49454 1.235693 1.760601
H  -4.300077 0.08623 2.408601
H  -3.861327 -2.175891 1.071314
H  -4.7740 -2.46091 -0.4308
H  -6.141691 -1.168006 1.273286
H  -5.891209 -0.234157 -0.222816
H  0.378199 2.441059 -1.575313
H  2.065019 -2.436443 1.510629
H  4.94841 1.128148 -0.522609
H  0.308212 -2.236454 1.046959
H  4.503958 -2.56684 1.717147
H  5.972452 -0.789904 0.702813
