program: Gaussian 09
title: 000223308
version: EM64L-G09RevD.01
frameworkgroup: C1[X(C13H7Cl2NS)]
method: RPBEPBE
basis: SDD
operation: Freq
keyword: #p
keyword: freq=noraman
keyword: PBEPBE/SDD
title: #p freq=noraman PBEPBE/SDD
converged: YES YES NO NO
title: Mulliken charges:
elementType: Cl Cl S N C C C C C C C C C C C C C H H H H H H H
charge: -0.006059 0.009779 0.289287 -0.016585 0.522900 -0.371347 0.423982 -0.239789 -0.391286 -0.335195 -0.091743 -0.229332 -0.281760 -0.117941 -0.133715 -0.510341 -0.292256 0.222283 0.255714 0.261997 0.264170 0.244086 0.250691 0.272459
chargesum: 0.00000
title: Mulliken charges with hydrogens summed into heavy atoms:
elementType: Cl Cl S N C C C C C C C C C C C C C
charge: -0.006059 0.009779 0.289287 -0.016585 0.522900 -0.149065 0.423982 -0.239789 -0.135572 -0.073198 -0.091743 0.034838 -0.037674 -0.117941 0.116977 -0.237882 -0.292256
polarizability: 4.17827476e+02 8.67379371e+00 1.93824845e+02 3.05950969e-02 4.01230457e-03 6.53319030e+01
1716.lowfreq: -2.4847 0.0013 0.0016 0.0026 3.0467 5.3355 11.7976 32.7230 43.8791
frequency: 11.2751 32.6890 43.8762 67.1488 113.1921 137.6141 159.1391 170.4565 173.8143 205.1476 224.4012 309.2082 316.4342 342.0507 363.7322 433.7370 440.4311 445.2440 470.4159 499.9163 553.7528 585.0917 627.5183 634.2302 660.0539 660.2166 700.6184 702.2438 707.3280 758.0586 810.0498 825.0540 828.5928 845.0627 868.2719 912.6423 932.6898 962.5086 969.1906 998.8330 1064.7097 1090.1311 1126.8180 1166.0796 1180.5733 1234.9099 1258.1912 1277.2652 1325.0216 1362.2970 1389.4422 1397.6630 1456.2730 1465.9748 1531.3019 1546.6755 1578.6047 1592.9751 2163.0278 3118.3972 3150.7166 3166.3960 3169.9547 3189.1532 3201.7511 3241.3585
redmass: 6.7055 11.6296 7.6538 8.0195 5.8669 13.5879 5.5596 8.6545 20.6617 17.3401 5.9693 9.1359 7.5685 4.1496 10.1660 7.5518 3.1246 10.0546 5.4185 9.9917 3.4424 4.1303 9.8104 8.0439 5.4465 7.6951 1.2865 7.1426 2.4930 7.3487 5.4362 1.3704 1.3534 6.4670 1.4502 1.3882 1.5486 4.2627 1.3690 5.2827 1.7766 1.1227 2.3564 1.5325 2.2489 1.6479 1.7587 2.2339 2.2052 3.3712 3.0647 2.3193 5.0457 3.0413 5.4647 7.2482 5.6867 6.2541 12.6310 1.0876 1.0920 1.0909 1.0901 1.0971 1.0940 1.0999
irintensity: 0.5041 1.8637 1.2655 0.8411 0.1838 3.6621 0.0514 0.9875 0.3077 0.9348 1.2522 1.1115 0.0674 0.4785 3.7965 3.5076 6.1645 28.6148 5.6280 6.0600 0.4985 8.9492 1.0548 4.5586 0.4215 15.8644 79.2315 20.4032 39.0411 1.1518 22.8816 26.6359 11.6741 21.1547 3.3659 0.6061 39.9363 14.3715 0.2162 29.8591 16.0725 0.8676 90.9064 0.5816 14.1413 4.7009 25.0982 10.2952 1.2624 14.0505 7.2630 17.2663 169.5929 26.7884 4.6610 20.3290 0.3455 13.6011 36.3610 14.5394 1.7750 0.9310 5.4120 6.1465 2.0192 0.9752
temp: 298.150 k
press: 1.00000 atm
elementType: 17 17 16 7 6 6 6 6 6 6 6 6 6 6 6 6 6 1 1 1 1 1 1 1
symmnumber: 1
zpe: 412398.2 jmol-1
zpe.correction: 0.157074 hartree
zpe.thermalcorrener: 0.172557 hartree
zpe.thermalcorrenthalpy: 0.173501 hartree
zpe.thermalcorrgfe: 0.110791 hartree
zpe.sumelectzpe: -1871.308796 hartree
zpe.sumelectthermal: -1871.293313 hartree
zpe.sumelectthermalent: -1871.292369 hartree
zpe.sumelectthermalfe: -1871.355080 hartree
dipole: -2.4623 -3.3857 0.0032
dipole: 4.1864
quadrupole: -114.2787 -119.5524 -124.0370
quadrupole: 15.7120 0.0118 0.0145
quadrupole: 5.0107 -0.2630 -4.7476 15.7120 0.0118 0.0145
hfenergy: -1871.4658706 hartree
pointgroup: C01 [X(C13H7Cl2N1S1)]
dipole: 1.1228949 1.1504791 -0.3582657 debye
dipolederiv: -0.335359 0.2730803 -0.0765866 0.4426357 -0.5024659 0.1333891 -0.1271787 0.1361245 -0.0697245 -1.0939836 -0.044608 0.0294631 -0.127873 -0.0547533 0.0125919 0.0534522 0.0113299 -0.0230232 0.245269 -0.0123271 0.0023143 0.0441785 -0.1792566 0.100114 -0.0150795 0.1010909 0.1288051 -0.2339744 -0.0174003 0.0051479 0.2193672 -0.2940328 0.0144117 -0.0649311 0.0182163 -0.2379971 0.1137909 -0.0131772 0.0024039 -0.0695194 0.0359384 0.0001846 0.0178477 -0.0005765 0.0333354 0.2087559 -0.2014482 0.0551021 0.1510831 0.0591227 -0.0520087 -0.0481091 -0.0466317 -0.0953777 0.5640145 0.1190812 -0.0428916 0.6772135 -0.0155803 0.0298252 -0.2085122 0.0387138 0.1128662 -0.1160567 -0.1065498 0.0312326 -0.6248451 0.1258468 -0.0768963 0.1855992 -0.0851375 -0.1427051 -0.1578659 0.1889527 -0.0552182 0.0268179 -0.1317064 0.0060563 -0.0075946 0.0037127 -0.1117008 -0.0601737 -0.019316 0.0051107 0.0975098 -0.0481576 -0.0230637 -0.0291515 -0.0212492 -0.1136697 0.1997829 -0.5695235 0.1658334 -0.8420915 0.7484915 -0.2191871 0.2474882 -0.2239148 0.030805 -0.3500819 0.0187627 -0.0015066 0.2309294 0.0093853 -0.0307165 -0.0648198 -0.0273179 -0.0727353 0.2441831 -0.0964596 0.0225658 0.221155 -0.1826621 0.0060682 -0.0720136 0.0111572 -0.1516085 1.2609539 0.247766 -0.0930748 0.1955875 -0.0662231 -0.0000366 -0.0770624 -0.0006858 -0.0552582 -0.4274426 0.1300766 -0.034152 0.3905019 -0.0995885 -0.0164922 -0.1121741 -0.0123474 -0.1278802 -0.3614756 0.1140552 -0.033262 -0.393565 0.2267751 -0.1534923 0.1184442 -0.1617942 -0.2627357 -0.0628271 0.020524 -0.004412 -0.4344539 0.2266098 -0.0484489 0.1304442 -0.0559153 0.0539025 0.0522148 -0.0142371 0.0052001 -0.1019833 -0.0487524 0.0516212 0.0312118 0.0505458 0.1057422 0.0535455 -0.0726115 0.0230095 -0.0568363 0.0219867 0.0411219 0.0182326 0.0413906 0.1451362 0.091841 0.0360337 -0.01 0.023626 0.0362824 0.0339442 -0.0062918 0.0337155 0.1416942 0.0372139 -0.0302738 0.0108694 -0.0500778 0.0134945 0.0449555 0.0166405 0.0446349 0.1487728 0.0628183 0.0897036 -0.0248329 0.0981274 0.0284217 0.0466586 -0.0273289 0.0466639 0.1759124 0.0458298 -0.0509355 0.0176138 -0.1067823 -0.0076909 0.0623278 0.0342656 0.0615508 0.1762444 0.0190268 0.0108317 0.0000701 -0.0107053 0.0985151 0.037072 0.0066211 0.0367238 0.2111995 unknown
polarizability: 416.5455077|-19.2627843|184.6565728|0.186391|-35.1658711|75.782144 unknown
InChI: InChI=1S/C13H7Cl2NS/c14-11-4-3-9(7-12(11)15)6-10(8-16)13-2-1-5-17-13/h1-7H
charge 0 multiplicity 1
24 atoms
Cl -4.258903 2.70321 -0.465684
Cl -5.681916 -0.139157 0.399769
S  4.247944 -1.083671 0.527626
N  1.19005 -2.907358 1.114995
C  -1.039078 0.225004 0.223985
C  0.403693 0.449003 0.135481
C  1.4824 -0.393787 0.366692
C  2.870723 0.060494 0.209059
C  -1.873101 1.340737 -0.09502
C  -1.679395 -0.997482 0.596553
C  -3.272711 1.24381 -0.046041
C  -3.080867 -1.088434 0.644148
C  3.363836 1.311185 -0.172747
C  -3.886242 0.027291 0.324344
C  4.796131 1.388072 -0.218473
C  5.425048 0.198843 0.125727
C  1.306381 -1.765627 0.775282
H  0.671949 1.469049 -0.169664
H  -1.421378 2.295446 -0.384837
H  -1.094133 -1.882358 0.8510
H  -3.562603 -2.027869 0.930188
H  2.723541 2.162103 -0.417196
H  5.342305 2.292023 -0.497357
H  6.488528 -0.027024 0.175767
