program: Gaussian 09
title: 000223306
version: EM64L-G09RevD.01
frameworkgroup: C1[X(C16H12O2)]
method: RPBEPBE
basis: SDD
operation: Freq
keyword: #pfreq=noraman
keyword: PBEPBE/SDD
title: #p freq=noraman PBEPBE/SDD
converged: NO NO NO NO
title: Mulliken charges:
elementType: O O C C C C C C C C C C C C C C C C H H H H H H H H H H H H
charge: -0.267030 -0.192227 0.221288 -0.536803 -0.450285 -0.523239 0.011752 0.261397 0.043291 0.065693 0.198953 -0.417869 0.428333 -0.484423 -0.372466 -0.425381 -0.235247 -0.236637 0.240412 0.240388 0.230951 0.230998 0.246686 0.246690 0.241249 0.239391 0.284602 0.244087 0.234572 0.230876
chargesum: 0.00000
title: Mulliken charges with hydrogens summed into heavy atoms:
elementType: O O C C C C C C C C C C C C C C C C
charge: -0.267030 -0.192227 0.221288 -0.056003 0.011663 -0.029863 0.011752 0.261397 0.043291 0.065693 0.198953 -0.176621 0.428333 -0.245033 -0.087865 -0.181294 -0.000675 -0.005761
polarizability: 2.99848608e+02 -5.88447343e+00 1.97723345e+02 9.62631575e-03 8.36194162e-03 7.88225100e+01
1716.lowfreq: -101.6209 -7.8013 -7.3418 -4.4923 -0.0009 -0.0005 0.0003 55.4406 84.0681
frequency: -101.5931 55.4352 84.0591 130.3641 152.1538 165.4255 191.6095 253.9597 263.7689 318.4956 319.3977 374.3961 423.7571 444.1732 470.3126 497.9963 539.0391 549.0589 573.4631 574.0443 618.5486 644.6153 675.9666 707.0781 725.5856 745.5285 749.6957 765.3238 787.2136 803.1439 829.1573 857.8133 883.1223 892.4132 901.5194 924.0823 962.5282 979.3602 981.9387 1001.9447 1025.4262 1031.6353 1034.3823 1055.4863 1132.3009 1143.6718 1152.8210 1174.5232 1191.4594 1193.3670 1225.7478 1235.5486 1238.7772 1252.1125 1273.0062 1297.9640 1316.9036 1355.1946 1378.8473 1412.3061 1423.8088 1438.4150 1453.0575 1463.1865 1475.4590 1485.9092 1508.8932 1559.6187 1603.2015 1610.0330 1631.7240 1690.3795 2979.2331 2996.0996 3022.7527 3028.6994 3039.7345 3087.5605 3124.1818 3130.6459 3140.4135 3155.1748 3158.0905 3175.1393
redmass: 1.5992 4.8972 4.9712 2.9810 4.9947 4.8128 4.5720 5.6475 5.0771 4.3547 6.9410 6.2596 3.1157 6.3810 3.6087 7.2481 7.2874 3.5438 6.6511 3.3162 7.9955 6.7873 4.3910 3.8187 5.7950 7.1201 1.2014 1.2795 8.6960 3.3793 1.4730 5.8397 5.5596 1.6160 1.5184 2.9897 1.3440 1.3971 5.7962 1.3366 2.5213 3.0822 1.7572 4.5249 2.1671 1.1873 1.3384 1.0848 2.3689 1.2064 1.6056 1.9272 1.0709 1.7967 1.7388 1.6502 2.0324 3.0731 3.4357 3.8146 2.9009 5.5304 1.1460 1.0902 3.3322 1.1016 3.6239 7.6310 6.1800 7.9682 7.1510 12.4831 1.0598 1.0600 1.1018 1.0620 1.1026 1.1048 1.0869 1.0868 1.0903 1.0976 1.0956 1.0982
irintensity: 0.8567 2.8336 0.1513 0.1299 0.5252 0.4331 0.3766 0.9918 1.3756 0.2970 6.3154 1.7308 5.1147 10.0048 2.0392 3.5483 1.0476 3.5360 0.6369 13.6968 1.7184 2.0090 0.2688 16.1031 0.4938 32.3595 3.3316 48.8480 41.9458 0.0833 75.3137 8.3839 54.7065 3.0866 0.1335 19.4543 0.0664 4.4795 3.3255 0.1528 7.5869 3.7927 0.0770 34.2405 0.8403 0.0148 2.2450 0.1980 0.2427 0.2284 0.2589 1.4565 0.0786 0.8861 7.4346 0.2643 13.5901 47.6987 8.4018 1.2972 0.8730 1.3038 6.4392 9.7680 49.9253 6.3808 7.1557 28.0408 8.3719 40.9675 37.6571 577.0981 21.6078 17.4838 8.9352 62.3897 4.6227 38.1637 1.7803 2.2423 14.5285 20.6624 25.9397 15.3150
temp: 298.150 k
press: 1.00000 atm
elementType: 8 8 6 6 6 6 6 6 6 6 6 6 6 6 6 6 6 6 1 1 1 1 1 1 1 1 1 1 1 1
symmnumber: 1
zpe: 612011.8 jmol-1
zpe.correction: 0.233103 hartree
zpe.thermalcorrener: 0.245861 hartree
zpe.thermalcorrenthalpy: 0.246805 hartree
zpe.thermalcorrgfe: 0.193879 hartree
zpe.sumelectzpe: -766.147787 hartree
zpe.sumelectthermal: -766.135029 hartree
zpe.sumelectthermalent: -766.134085 hartree
zpe.sumelectthermalfe: -766.187011 hartree
dipole: 0.4509 -5.1983 0.0009
dipole: 5.2178
quadrupole: -84.0393 -107.4772 -106.7001
quadrupole: 10.1732 0.0008 0.0049
quadrupole: 15.3662 -8.0717 -7.2945 10.1732 0.0008 0.0049
hfenergy: -766.3808896 hartree
pointgroup: C01 [X(C16H12O2)]
dipole: 0.2042916 -2.0426306 0.0077252 debye
polarizability: 299.9716493|-4.5459986|197.5842482|-1.7489123|-0.4779688|78.8385655 unknown
InChI: InChI=1S/C16H12O2/c17-16-14-7-3-6-12(14)13-9-8-10-4-1-2-5-11(10)15(13)18-16/h1-2,4-5,8-9H,3,6-7H2
charge 0 multiplicity 1
30 atoms
O  -0.338054 1.574769 0.002797
O  -2.233225 2.914872 0.011792
C  -1.926414 -0.741586 0.025799
C  -2.946051 -1.86455 0.03908
C  -4.337745 -1.140234 0.048131
C  -4.057165 0.402769 0.037882
C  -2.545867 0.496148 0.025342
C  -0.487455 -0.871634 0.014667
C  0.271902 0.325315 0.003379
C  -1.810095 1.743419 0.013796
C  1.709092 0.313693 -0.007993
C  0.207431 -2.131264 0.014539
C  2.376755 -0.969689 -0.007881
C  1.595447 -2.17949 0.003535
C  2.481911 1.517735 -0.019125
C  3.807705 -0.995945 -0.019177
C  3.878807 1.455929 -0.029948
C  4.54645 0.191892 -0.029996
H  -2.823499 -2.519301 -0.84565
H  -2.808102 -2.512256 0.92671
H  -4.933982 -1.43393 -0.832356
H  -4.917736 -1.424947 0.942318
H  -4.479629 0.914579 0.922588
H  -4.493732 0.905465 -0.84521
H  -0.379062 -3.056116 0.023331
H  2.117055 -3.143121 0.003482
H  1.957285 2.477247 -0.018923
H  4.318776 -1.965967 -0.019166
H  4.467313 2.379584 -0.038429
H  5.641384 0.157314 -0.038516
