program: Gaussian 09
title: 000223301
version: EM64L-G09RevD.01
frameworkgroup: C1[X(C13H8F2O3)]
method: RPBEPBE
basis: SDD
operation: Freq
keyword: #p
keyword: freq=noraman
keyword: PBEPBE/SDD
title: #p freq=noraman PBEPBE/SDD
converged: YES YES NO NO
title: Mulliken charges:
elementType: F F O O O C C C C C C C C C C C C C H H H H H H H H
charge: -0.180365 -0.217028 -0.225815 -0.392285 -0.408424 0.339594 0.343754 0.019979 -0.494015 -0.476638 -0.351035 -0.361253 0.232983 0.188538 -0.349790 -0.310258 0.130926 0.123231 0.301527 0.294101 0.269404 0.279411 0.231899 0.264140 0.367269 0.380153
chargesum: 0.00000
title: Mulliken charges with hydrogens summed into heavy atoms:
elementType: F F O O O C C C C C C C C C C C C C
charge: -0.180365 -0.217028 -0.225815 -0.025017 -0.028271 0.339594 0.343754 0.019979 -0.192488 -0.182537 -0.081631 -0.081842 0.232983 0.188538 -0.117891 -0.046118 0.130926 0.123231
polarizability: 2.57703817e+02 8.41763707e+00 1.55342710e+02 -8.50138925e+00 4.06219144e+00 7.79711509e+01
1716.lowfreq: -0.0009 -0.0008 0.0002 2.1896 5.7948 9.5099 35.9930 46.2005 60.2754
frequency: 35.9790 46.1946 60.2736 102.6283 137.5958 174.6839 202.9721 212.8375 236.0397 267.3255 280.9673 302.8607 328.2242 351.8970 373.6187 409.7485 435.5552 443.7783 446.9353 458.3739 519.7418 537.6819 543.7074 557.2409 604.5712 611.7748 659.0726 694.1594 717.1547 744.1359 754.7659 765.8399 805.7468 817.6299 842.9016 888.8526 896.5818 906.5117 949.6141 973.4014 985.7221 1071.2362 1076.4119 1115.4956 1155.3983 1161.6272 1166.5749 1202.4495 1237.8543 1266.4960 1277.4768 1297.4975 1315.9293 1389.5066 1392.9363 1429.3748 1432.1233 1498.8798 1503.8219 1532.5508 1584.8228 1591.9149 1619.2939 1624.4434 3125.0062 3162.0069 3165.6645 3172.5599 3174.1760 3181.9472 3546.9539 3577.5315
redmass: 8.7199 7.1783 7.1478 9.0283 7.4149 8.2592 6.5902 7.0202 7.3181 7.6240 8.5989 7.0138 5.3603 9.7045 1.1698 7.0372 5.6687 3.2700 3.4726 1.0991 6.6765 5.8981 6.6933 6.0250 7.0717 5.5001 6.9857 4.8349 3.8415 5.6002 4.7206 4.0542 1.5849 5.7576 1.4799 1.4328 3.6672 1.8304 1.2941 1.3875 2.8060 2.3974 2.5968 1.7431 1.4024 1.3106 1.4575 2.7845 1.8693 1.5884 2.4977 2.1127 2.8405 3.9620 5.7582 5.3172 5.7586 3.4248 3.4560 9.8948 6.6662 7.1140 7.2949 7.6052 1.0897 1.0887 1.0940 1.0925 1.0924 1.0971 1.0655 1.0663
irintensity: 0.1735 0.9811 1.1696 3.1935 0.2061 1.5181 2.0830 0.4019 0.2218 7.9181 6.2410 6.1452 3.0246 2.8540 144.0831 1.3918 13.9807 1.0816 4.7818 168.3372 4.4278 7.4748 26.7148 10.0698 27.7494 7.1736 0.3735 13.7511 1.8564 34.5392 98.5264 28.8102 24.1342 8.3618 26.1999 18.7559 0.3496 31.6362 1.2082 3.4006 19.5045 44.8408 178.3035 76.7674 78.2702 75.1087 191.6770 103.1435 86.5242 167.5402 132.2317 305.5448 135.6159 3.8265 16.8201 56.1140 16.4589 66.8899 69.1198 222.5197 10.3224 3.1501 197.9619 21.6463 14.2384 0.1524 3.5516 4.1329 1.6209 4.5207 113.6457 82.7110
temp: 298.150 k
press: 1.00000 atm
elementType: 9 9 8 8 8 6 6 6 6 6 6 6 6 6 6 6 6 6 1 1 1 1 1 1 1 1
symmnumber: 1
zpe: 467352.6 jmol-1
zpe.correction: 0.178005 hartree
zpe.thermalcorrener: 0.193234 hartree
zpe.thermalcorrenthalpy: 0.194178 hartree
zpe.thermalcorrgfe: 0.134967 hartree
zpe.sumelectzpe: -924.266667 hartree
zpe.sumelectthermal: -924.251438 hartree
zpe.sumelectthermalent: -924.250494 hartree
zpe.sumelectthermalfe: -924.309705 hartree
dipole: 1.6716 -4.9593 -1.9667
dipole: 5.5908
quadrupole: -108.6195 -98.4161 -101.1701
quadrupole: 10.2548 7.2290 3.5014
quadrupole: -5.8843 4.3191 1.5652 10.2548 7.2290 3.5014
hfenergy: -924.4446724 hartree
pointgroup: C01 [X(C13H8F2O3)]
dipole: 0.6710317 -2.0861136 0.1896314 debye
dipolederiv: -0.8972628 0.3171547 0.1963525 0.470326 -0.3746199 -0.1249519 0.2226995 -0.0996982 -0.1815853 -0.3253536 0.1384954 -0.1347839 0.2790903 -0.4760588 0.3907391 -0.2874451 0.3936687 -0.5936936 -0.8586587 0.0229784 -0.0292901 -0.0370841 -0.9290692 0.2650717 -0.1345487 0.2491814 -0.4185284 -1.3179402 -0.6481957 0.2124203 -0.7837706 -0.4468924 0.1967898 0.2622918 0.1916116 -0.4486254 -1.599619 0.3856253 -0.2279404 0.5212032 -0.4365719 -0.0677663 -0.3024774 -0.0681817 -0.2442397 -0.7868014 -0.3435766 0.142141 -0.3145921 -0.2455927 0.1069963 0.1431985 0.0973975 -0.088978 -0.9400594 0.1538766 -0.0328781 0.1900849 -0.1464509 0.0289614 -0.0605121 0.0525683 -0.0579194 2.28784 0.1295273 -0.0595655 0.1774754 0.9509906 -0.3553057 -0.0189624 -0.3437021 0.287594 0.1389974 0.1978778 -0.0605742 -0.1298493 0.0063252 0.0237251 0.0327067 -0.0417717 -0.1050847 0.1130762 -0.0227619 -0.0184745 -0.2810646 -0.0404586 -0.0100655 0.1009311 -0.025024 -0.0530994 0.079458 0.0839587 -0.0579626 0.23976 0.1440202 -0.0343278 -0.1751809 -0.052976 -0.061812 0.2910754 -0.0726448 -0.0105706 0.0963677 -0.0256855 -0.105191 -0.0669268 -0.0805844 0.0003192 0.841095 -0.4466607 -0.2078019 -0.9731506 0.1950253 0.2446906 -0.2300405 0.1348766 0.1293573 -0.2670842 -0.0076513 0.0525432 -0.3693547 0.4368122 -0.4546151 0.5532437 -0.5022318 0.5792907 -0.5022215 -0.223376 0.0676133 0.124867 0.0768786 -0.0205472 0.1067263 0.0654699 -0.1960456 -0.2259775 0.0608335 -0.076101 0.2855346 -0.1632949 -0.0535356 -0.3367986 -0.0055365 -0.0722632 1.180136 0.6128733 -0.2792094 0.8305652 0.4240404 -0.2143055 -0.3137961 -0.1785091 0.1525692 1.5106679 -0.4515166 0.2320302 -0.4302207 0.2058096 -0.0350092 0.1358726 -0.0168123 0.0610966 0.1558455 -0.0189442 0.0160953 0.0350661 0.0491017 -0.0151855 -0.0153626 0.0140975 0.1709666 0.1035949 -0.0216525 0.0699691 -0.02885 0.1011899 0.050854 0.0968759 0.042715 0.0817886 0.0196644 0.0739557 0.0501125 0.1104117 0.0634167 -0.0179321 0.0625971 -0.0032642 0.1117389 0.1326637 0.0434198 -0.0345261 -0.0051081 0.0893498 0.0858397 -0.0169284 0.0577823 0.0747748 0.0564731 -0.0443183 0.0273886 -0.0612111 -0.0980527 0.0041324 0.0398872 0.0098822 0.1604519 -0.0005723 -0.01884 0.0662329 -0.018427 0.1310029 0.0544866 0.0638347 0.0582186 0.0840039 0.3678585 0.1681864 0.0142857 0.1889071 0.1787487 -0.0492452 0.0080176 -0.0514298 0.3851864 0.4431047 -0.0686243 0.0824938 -0.1169764 0.3300357 0.1056968 0.1300969 0.1022522 0.242737 unknown
polarizability: 255.6841595|1.6581874|141.7307729|-21.4982784|-29.9002674|93.6027455 unknown
InChI: InChI=1S/C13H8F2O3/c14-9-5-7(1-3-11(9)16)13(18)8-2-4-12(17)10(15)6-8/h1-6,16-17H
charge 0 multiplicity 1
26 atoms
F  -4.792312 1.057423 0.723134
F  3.354629 -1.637599 1.642221
O  -0.248613 2.29651 -1.20995
O  -4.881259 -1.672072 0.74103
O  5.316133 -0.687719 -0.097471
C  -1.287771 0.338607 -0.285536
C  1.294842 0.586311 -0.535865
C  -0.08976 1.138451 -0.705416
C  -2.475212 1.050459 0.041663
C  1.634534 -0.335375 0.493501
C  -1.319809 -1.081243 -0.289474
C  2.323874 1.076818 -1.389072
C  -3.631782 0.351504 0.382741
C  2.965061 -0.734037 0.616651
C  -2.50184 -1.775884 0.038672
C  3.655546 0.649105 -1.253171
C  -3.676261 -1.068379 0.391435
C  3.995824 -0.272325 -0.235816
H  -2.476547 2.144176 0.012998
H  0.892936 -0.699838 1.209395
H  -0.434317 -1.648763 -0.589605
H  2.050292 1.808989 -2.154637
H  -2.517486 -2.872691 0.014505
H  4.447142 1.014147 -1.913157
H  -4.808705 -2.658747 0.707894
H  5.404964 -1.317328 0.664429
