program: Gaussian 09
title: 000223295
version: EM64L-G09RevD.01
frameworkgroup: C1[X(C18H19NO)]
method: RPBEPBE
basis: SDD
operation: Freq
keyword: #p
keyword: freq=noraman
keyword: PBEPBE/SDD
title: #p freq=noraman PBEPBE/SDD
converged: YES YES NO YES
title: Mulliken charges:
elementType: O N C C C C C C C C C C C C C C C C C C H H H H H H H H H H H H H H H H H H H
charge: -0.446492 -0.068339 -0.118355 -0.041896 -0.458542 -0.430534 -0.411422 0.195245 0.210070 0.118501 0.120295 -0.631448 -0.368570 -0.368511 -0.400123 -0.400648 -0.258034 -0.259101 -0.232167 -0.232604 0.278294 0.223628 0.245545 0.240960 0.204352 0.183844 0.220459 0.342038 0.222933 0.184828 0.224607 0.262481 0.255731 0.240516 0.240660 0.228372 0.228140 0.227674 0.227614
chargesum: 0.00000
title: Mulliken charges with hydrogens summed into heavy atoms:
elementType: O N C C C C C C C C C C C C C C C C C C
charge: -0.104455 -0.068339 0.159939 -0.041896 0.010631 0.014778 -0.007119 0.195245 0.210070 0.118501 0.120295 0.000921 -0.106089 -0.112780 -0.159606 -0.159988 -0.029663 -0.030961 -0.004493 -0.004990
polarizability: 2.29033688e+02 9.16022279e+00 2.57261644e+02 2.43692780e+01 -1.89415322e+00 1.20675598e+02
1716.lowfreq: -8.1816 -0.0003 -0.0001 0.0004 2.8668 12.4984 44.8629 50.6872 74.0048
frequency: 44.8539 50.6481 73.9894 90.0756 108.7797 133.7279 163.3515 190.9458 220.2862 230.9496 235.2089 261.1457 274.4595 310.3585 319.3208 337.3291 364.9680 377.1885 419.9681 429.3167 488.5299 507.8466 509.5602 568.2798 573.7022 604.8799 617.2722 638.6731 658.5142 715.3284 748.6440 755.8586 759.1573 767.2435 799.4633 824.4213 854.2053 874.4985 883.0358 884.0855 897.5806 951.0863 953.5600 960.9160 976.2008 986.5414 988.1924 989.0367 997.1209 1022.1580 1024.3628 1035.1211 1066.5268 1086.1949 1094.0050 1105.3922 1105.9543 1116.6513 1160.5375 1167.5502 1168.5260 1179.1984 1179.6139 1186.1180 1209.5736 1226.4709 1238.4507 1249.1794 1270.0101 1277.7972 1292.4208 1296.1951 1300.0654 1314.4494 1340.1675 1354.4212 1373.2008 1404.7137 1430.3006 1436.1051 1442.6310 1463.5812 1464.3627 1471.6015 1475.7388 1481.5734 1482.7019 1496.4573 1592.7303 1593.1877 1615.6912 1616.1894 2840.6283 2850.0612 2867.4180 3013.4445 3015.3460 3017.7173 3028.0905 3046.1528 3071.9337 3092.7999 3124.2393 3125.4083 3135.5204 3137.0593 3150.6914 3153.0936 3164.3974 3166.9701 3556.4916
redmass: 3.4043 2.7777 4.1461 3.3273 4.1277 2.7476 3.0186 4.6410 3.3248 2.0704 1.5330 3.8919 4.6844 3.1585 2.3279 1.2557 2.7068 4.0558 5.5502 3.3510 3.2686 4.2838 3.4989 3.4573 3.8301 3.9022 7.0093 6.5759 4.8620 5.0955 2.2707 1.5725 4.9954 1.6627 2.4965 1.7981 2.7977 2.0131 1.8701 1.6144 2.9603 1.4243 1.4351 3.8172 1.6931 1.3304 1.3498 1.8374 6.4844 2.6111 2.2378 1.9566 2.1391 2.0117 2.1543 1.7984 1.8254 1.7256 1.9410 1.3089 1.3445 1.6221 1.4503 1.8869 1.6362 1.7610 1.8741 1.5255 1.2917 1.3976 1.3405 1.3362 1.8439 1.6092 1.4994 1.5802 9.4566 3.5160 1.1712 2.2149 2.7407 1.2046 1.9064 1.0816 1.0884 1.6545 1.6790 1.1066 6.9149 6.7351 7.3799 6.9724 1.0601 1.0699 1.0683 1.0802 1.0724 1.0837 1.0680 1.0911 1.1009 1.1053 1.0855 1.0853 1.0900 1.0903 1.0943 1.0948 1.0997 1.0986 1.0661
irintensity: 0.2568 0.8370 0.1488 0.6487 0.9926 0.9140 0.7754 0.2548 0.1319 0.2690 0.5325 0.1208 1.1912 6.0757 16.5748 88.8913 5.5534 0.6553 0.7397 8.6199 2.2097 1.1669 0.4169 1.3029 6.8782 1.3495 4.6055 1.9347 22.9046 8.0208 101.4049 0.2159 4.0177 78.0650 0.2235 2.2696 12.6163 2.2114 5.1848 0.7506 8.1363 3.9906 1.0390 26.7357 4.3474 0.0151 1.1545 14.1054 2.4601 15.3004 18.0838 4.5203 18.5584 14.4448 5.4996 4.1180 1.9613 4.4259 35.0731 7.3551 7.5744 1.3901 3.9803 0.1978 0.0940 7.6909 3.3387 8.3276 19.7706 22.3540 20.6094 3.8686 2.4969 23.3791 1.6289 2.4996 7.2116 1.1332 0.9095 33.1662 12.2073 25.2438 7.4407 4.3363 2.7984 1.9835 0.8607 5.1759 0.9286 0.9785 6.2376 0.7934 75.5589 125.2488 143.0022 10.2635 46.9557 35.9443 50.9959 25.3457 31.9359 20.6868 2.8605 0.2000 11.3977 5.3547 19.6937 37.4988 37.2610 18.3474 9.6162
temp: 298.150 k
press: 1.00000 atm
elementType: 8 7 6 6 6 6 6 6 6 6 6 6 6 6 6 6 6 6 6 6 1 1 1 1 1 1 1 1 1 1 1 1 1 1 1 1 1 1 1
symmnumber: 1
zpe: 848365.6 jmol-1
zpe.correction: 0.323125 hartree
zpe.thermalcorrener: 0.340103 hartree
zpe.thermalcorrenthalpy: 0.341048 hartree
zpe.thermalcorrgfe: 0.278899 hartree
zpe.sumelectzpe: -825.847020 hartree
zpe.sumelectthermal: -825.830042 hartree
zpe.sumelectthermalent: -825.829098 hartree
zpe.sumelectthermalfe: -825.891246 hartree
dipole: -1.3428 0.3324 0.5499
dipole: 1.4887
quadrupole: -108.5256 -105.5936 -122.4080
quadrupole: 1.0284 4.1841 -0.1248
quadrupole: 3.6502 6.5821 -10.2323 1.0284 4.1841 -0.1248
hfenergy: -826.1701452 hartree
pointgroup: C01 [X(C18H19N1O1)]
dipole: 0.5276399 0.1302875 -0.2182885 debye
polarizability: 229.1563175|-9.0228687|257.2377227|24.2748757|0.8026229|120.5768899 unknown
InChI: InChI=1S/C18H19NO/c1-19-11-10-13(12-19)18(20)16-8-4-2-6-14(16)15-7-3-5-9-17(15)18/h2-9,13,20H,10-12H2,1H3
charge 0 multiplicity 1
39 atoms
O  -0.736546 -0.349122 -2.005779
N  -3.779563 -0.130856 0.759413
C  -1.487213 -0.451533 0.299747
C  -0.250501 -0.202841 -0.612985
C  -2.216192 -1.81505 0.037926
C  -2.625912 0.591059 0.174719
C  -3.732541 -1.497707 0.175942
C  0.409053 1.168851 -0.36399
C  0.909452 -1.164901 -0.276757
C  1.714229 1.004346 0.1854
C  2.022686 -0.441026 0.242878
C  -5.074997 0.54851 0.627124
C  -0.095929 2.45425 -0.624574
C  0.973082 -2.56199 -0.414831
C  2.503265 2.125804 0.516856
C  3.191207 -1.113993 0.656618
C  0.701119 3.583365 -0.305731
C  2.15254 -3.23998 -0.012215
C  1.984366 3.419666 0.271377
C  3.247383 -2.522596 0.528392
H  -1.130027 -0.43102 1.346242
H  -1.88786 -2.579931 0.761102
H  -1.995424 -2.172549 -0.980916
H  -2.42598 1.51658 0.742069
H  -2.788675 0.853463 -0.901428
H  -4.219606 -1.525165 -0.832076
H  -4.268976 -2.211132 0.828311
H  0.030233 -0.194021 -2.614319
H  -5.860249 -0.042095 1.133051
H  -5.388685 0.69623 -0.438973
H  -5.032009 1.540189 1.112748
H  -1.081091 2.585127 -1.083101
H  0.134846 -3.12259 -0.838872
H  3.505123 2.004894 0.943912
H  4.047224 -0.562391 1.061261
H  0.321873 4.591237 -0.508169
H  2.217056 -4.328527 -0.119793
H  2.584537 4.302805 0.517894
H  4.1484 -3.062455 0.840826
