program: Gaussian 09
title: 000223291
version: EM64L-G09RevD.01
frameworkgroup: C1[X(C14H21N3O3S)]
method: RPBEPBE
basis: SDD
operation: Freq
keyword: #p
keyword: freq=noraman
keyword: PBEPBE/SDD
title: #p freq=noraman PBEPBE/SDD
converged: YES YES NO NO
title: Mulliken charges:
elementType: S O O O N N N C C C C C C C C C C C C C C H H H H H H H H H H H H H H H H H H H H H
charge: 1.000276 -0.302242 -0.548997 -0.484735 -0.073376 -0.376100 -0.678120 -0.438151 -0.427999 -0.442937 -0.446447 -0.300190 -0.400824 0.397265 -0.053870 -0.262064 -0.175633 0.454486 -0.338490 -0.409570 -0.800353 0.222535 0.216909 0.224666 0.235789 0.217117 0.225107 0.229629 0.219409 0.195563 0.213189 0.257172 0.236102 0.292674 0.335328 0.290157 0.304357 0.243186 0.245270 0.240736 0.233248 0.229929
chargesum: 0.00000
title: Mulliken charges with hydrogens summed into heavy atoms:
elementType: S O O O N N N C C C C C C C C C C C C C C
charge: 1.000276 -0.302242 -0.548997 -0.484735 -0.073376 -0.083427 -0.342792 0.001292 0.032456 -0.000712 0.002590 0.108563 0.092450 0.397265 -0.053870 0.028093 0.128724 0.454486 -0.095304 -0.164301 -0.096439
polarizability: 2.15757235e+02 -1.15272501e+01 2.31098055e+02 1.39746074e+01 7.77520385e+00 1.72411913e+02
1716.lowfreq: -15.6163 -7.4133 -2.0103 -0.0016 0.0005 0.0024 5.7125 10.2195 15.1210
frequency: -15.4896 9.0145 13.9905 20.2768 30.4234 42.6800 44.9274 73.3294 79.0534 100.5672 109.3615 134.0201 135.9726 161.8129 205.5144 229.1011 230.5001 264.0048 275.5778 286.5645 312.0325 314.8569 351.5288 382.8263 395.7570 406.6225 415.3062 424.3480 473.4588 495.2031 514.1869 582.2517 620.7742 627.7449 636.2913 661.9474 700.6167 705.5577 714.0363 762.6498 776.0132 789.3859 814.2467 823.4554 831.5771 842.6387 847.4550 877.7681 909.1027 933.6726 935.2062 954.3964 958.7275 979.8168 986.9288 994.3691 1019.1640 1030.0231 1048.8747 1049.0072 1051.5295 1071.4195 1076.5581 1091.0725 1121.4890 1139.1346 1172.4188 1175.8226 1187.7179 1199.6639 1217.6132 1218.0373 1243.9879 1251.1222 1282.9917 1298.3669 1298.8869 1300.2922 1312.0719 1320.6610 1326.8278 1337.5421 1377.8628 1382.2256 1391.5024 1399.5456 1442.9054 1462.4646 1467.4305 1470.0803 1470.2956 1472.1973 1474.8904 1476.3144 1481.0848 1487.7052 1592.6851 1596.0789 1613.0616 2900.5095 2981.7185 2985.7325 2997.0861 3002.5269 3018.8194 3023.4245 3028.6689 3053.9221 3061.5121 3069.5283 3075.9752 3089.9536 3092.5903 3097.2556 3134.7868 3142.8456 3163.7891 3186.4357 3491.1296 3562.4493
redmass: 1.0419 4.2227 2.8589 4.1567 2.7350 2.4211 4.7109 4.4539 4.2970 4.3552 5.6534 2.7362 6.9208 4.9082 7.7599 8.0038 4.7582 3.6453 2.1759 3.3736 4.4340 2.0291 2.3954 3.9035 3.4887 2.8575 4.4100 3.5674 4.4219 1.3076 3.3628 5.8153 6.8698 2.4427 2.7806 3.2789 5.5900 3.7920 4.5698 1.8064 5.0005 1.4315 5.3225 1.5988 1.6794 1.2593 2.4971 3.5646 2.6009 1.9136 2.9335 1.3372 8.5496 1.3772 2.1222 2.5792 3.0786 3.1711 2.5882 1.6064 2.4336 1.8398 2.2407 2.9749 1.2930 2.0691 1.3440 1.4642 1.1357 1.3847 2.9582 1.1638 1.3788 1.3758 1.3327 1.2406 1.1341 1.2551 1.3478 1.2996 1.6400 1.4846 1.3262 5.4722 2.5291 1.3544 1.1147 1.0864 1.1371 1.0614 1.0807 2.2840 1.1022 1.0923 1.6493 1.0962 6.1093 6.8256 6.8427 1.0679 1.0378 1.0649 1.0642 1.0596 1.0642 1.0903 1.0613 1.1013 1.0969 1.1002 1.1030 1.1058 1.0992 1.1051 1.0894 1.0907 1.0957 1.0953 1.0787 1.0779
irintensity: 0.5110 0.0987 0.1486 1.5080 0.8294 0.3765 2.4790 0.6357 7.7773 3.5377 4.6091 0.8007 2.9541 0.1036 3.9944 10.3805 0.9310 2.5834 14.6566 9.3718 12.2473 10.2825 5.1476 1.5375 27.6280 0.6295 17.0769 51.2254 7.9649 230.1356 81.1412 10.3461 0.1506 14.9289 13.0583 27.8150 111.1472 11.0215 76.7673 2.8942 15.9635 3.3798 139.8410 22.2652 1.8747 7.9086 6.4494 12.5694 1.0393 3.7029 34.0045 1.3775 69.6361 0.8986 5.2469 5.9578 14.3384 7.1181 5.5769 15.7513 25.4895 21.7262 25.4586 48.8547 7.0261 1.6692 8.2438 75.5275 10.3406 47.7194 3.4172 5.0766 19.5118 4.0753 5.0031 2.0758 10.6252 3.6865 54.4997 6.3148 97.0150 155.3386 10.2232 2.4534 13.3146 15.1350 34.1963 4.5375 50.2224 18.4147 10.0685 28.4421 16.2027 2.9488 341.0221 8.3803 14.8779 5.7040 122.7566 58.9090 24.4723 56.7871 42.7490 42.1674 38.7733 19.6758 38.1197 18.3909 16.7696 5.1375 15.1851 106.5323 15.9829 15.4014 11.9626 10.0510 5.7227 6.4253 28.4753 26.7267
temp: 298.150 k
press: 1.00000 atm
elementType: 16 8 8 8 7 7 7 6 6 6 6 6 6 6 6 6 6 6 6 6 6 1 1 1 1 1 1 1 1 1 1 1 1 1 1 1 1 1 1 1 1 1
symmnumber: 1
zpe: 886796.1 jmol-1
zpe.correction: 0.337763 hartree
zpe.thermalcorrener: 0.359870 hartree
zpe.thermalcorrenthalpy: 0.360814 hartree
zpe.thermalcorrgfe: 0.281125 hartree
zpe.sumelectzpe: -1332.292628 hartree
zpe.sumelectthermal: -1332.270520 hartree
zpe.sumelectthermalent: -1332.269576 hartree
zpe.sumelectthermalfe: -1332.349266 hartree
dipole: 3.0068 4.4242 -3.8440
dipole: 6.5871
quadrupole: -137.3812 -122.6145 -132.4427
quadrupole: -21.4639 1.2086 9.9405
quadrupole: -6.5684 8.1983 -1.6299 -21.4639 1.2086 9.9405
hfenergy: -1332.6303906 hartree
pointgroup: C01 [X(C14H21N3O3S1)]
dipole: -1.1774505 -2.0487532 -1.0641707 debye
polarizability: 215.9542628|-14.1285525|224.1201708|-10.1795994|-20.952106|179.1927694 unknown
InChI: InChI=1S/C14H21N3O3S/c1-12-4-6-13(7-5-12)21(19,20)16-14(18)15-8-11-17-9-2-3-10-17/h4-7,15-16H,2-3,8-11H2,1H3
charge 0 multiplicity 1
42 atoms
S  2.605254 1.83063 -0.414311
O  -0.242305 1.168293 0.646276
O  3.552898 2.203623 -1.684707
O  2.665626 2.696816 0.948027
N  -4.582759 0.34647 -0.211326
N  -1.398251 2.228817 -1.091693
N  0.939362 1.973776 -1.207562
C  -5.5199 -0.599785 -0.882033
C  -4.335753 -0.302522 1.114046
C  -5.044797 -2.044659 -0.504252
C  -4.291623 -1.851259 0.853684
C  -3.332594 0.618836 -0.966618
C  -2.722448 1.964201 -0.500915
C  -0.246406 1.764154 -0.473174
C  2.799786 0.000238 -0.025713
C  3.491726 -0.776646 -0.968895
C  2.310223 -0.491116 1.192463
C  3.22497 -2.6964 0.557312
C  3.696846 -2.138341 -0.661933
C  2.53485 -1.857944 1.471813
C  3.473931 -4.159032 0.877037
H  -5.552497 -0.415158 -1.969446
H  -6.536215 -0.424862 -0.478436
H  -5.176351 -0.054599 1.789052
H  -3.40775 0.080053 1.570809
H  -5.894918 -2.744053 -0.417128
H  -4.362818 -2.44471 -1.276023
H  -3.24924 -2.208203 0.781462
H  -4.774017 -2.405728 1.677743
H  -3.580829 0.681713 -2.043196
H  -2.560561 -0.177864 -0.848548
H  -2.599223 1.951856 0.594899
H  -3.409069 2.789972 -0.756313
H  -1.346247 2.700966 -1.994454
H  1.000523 2.534663 -2.06611
H  3.867478 -0.324884 -1.892454
H  1.764333 0.160948 1.87872
H  4.235037 -2.773007 -1.375471
H  2.163239 -2.276073 2.413766
H  4.549686 -4.347094 1.055628
H  3.165022 -4.812183 0.040637
H  2.92488 -4.477601 1.778933
