program: Gaussian 09
title: 000223290
version: EM64L-G09RevD.01
frameworkgroup: C1[X(C18H13NO2)]
method: RPBEPBE
basis: SDD
operation: Freq
keyword: #p
keyword: freq=noraman
keyword: PBEPBE/SDD
title: #p freq=noraman PBEPBE/SDD
converged: YES YES NO NO
title: Mulliken charges:
elementType: O O N C C C C C C C C C C C C C C C C C C H H H H H H H H H H H H H
charge: -0.266765 -0.447912 0.001826 -0.076479 0.270841 0.283216 0.424612 0.076797 0.078861 -0.346935 -0.346285 -0.356781 -0.354456 -0.301578 -0.502522 -0.252994 -0.251296 -0.221896 -0.222346 -0.189845 -0.346802 0.264958 0.263550 0.347591 0.260741 0.260596 0.248010 0.298733 0.232839 0.232662 0.234430 0.234549 0.230251 0.239827
chargesum: 0.00000
title: Mulliken charges with hydrogens summed into heavy atoms:
elementType: O O N C C C C C C C C C C C C C C C C C C
charge: -0.266765 -0.100321 0.001826 -0.076479 0.270841 0.283216 0.424612 0.076797 0.078861 -0.081977 -0.082735 -0.096040 -0.093860 -0.053567 -0.203789 -0.020155 -0.018634 0.012533 0.012204 0.040406 -0.106975
polarizability: 2.22843922e+02 -4.35066981e+00 2.34786461e+02 -2.18624742e+01 -1.55263061e+00 1.42267971e+02
1716.lowfreq: -7.9366 -6.7772 -0.0009 0.0007 0.0008 7.4945 12.1975 26.1527 55.3557
frequency: 8.5604 26.0606 55.3496 78.6287 117.0034 187.9096 199.7432 209.6534 240.0378 260.5689 296.6854 308.0157 337.0195 339.3454 377.7297 391.1604 412.8723 427.6559 459.3777 495.9489 509.7585 543.8288 567.2616 582.3825 607.5641 624.3914 626.4392 654.8576 686.2771 721.2860 731.6864 735.4424 765.2247 768.9606 780.1821 808.6522 858.2230 861.4113 866.9103 885.8486 915.8144 933.5174 950.1122 955.5778 959.0398 964.2760 985.7442 986.2208 986.5806 1003.9033 1027.5522 1030.0903 1035.8552 1090.7334 1104.4630 1119.9711 1156.3491 1164.7288 1167.7432 1172.0961 1195.8102 1200.7624 1210.5826 1229.8664 1278.7138 1285.6743 1293.4760 1309.9015 1330.7796 1384.9785 1394.1361 1408.7320 1433.4669 1446.9798 1453.1918 1467.3412 1475.3764 1554.6435 1576.1848 1584.6917 1599.2783 1609.2413 1628.4011 3127.3768 3134.3400 3136.5484 3137.0784 3146.9081 3147.4240 3162.0582 3162.4615 3163.9157 3174.3182 3174.7359 3176.7342 3558.0868
redmass: 4.9809 5.1609 5.0432 5.2119 3.8684 5.3282 4.0949 4.8435 4.2348 5.9710 2.8062 5.6303 2.5476 2.0414 6.2410 3.0712 5.1777 4.3510 3.6991 3.9547 3.9783 4.1259 5.3945 7.1384 7.3395 6.1421 6.5246 6.2671 6.5493 2.2022 3.2672 4.6796 1.3965 1.2637 4.6224 1.8869 5.0572 1.5715 1.4204 3.3578 4.1752 1.3440 3.7273 1.3983 1.6868 1.6647 1.3222 1.3450 1.3742 3.6886 3.3359 2.2792 1.9313 2.2122 2.2220 1.7198 1.8078 1.6737 1.0842 1.3673 1.8358 1.5896 1.8428 4.1661 1.5093 1.9102 2.2895 4.2623 1.2555 11.1197 9.7715 2.1434 2.4482 2.4726 2.2016 2.5220 2.5746 5.7958 6.9726 5.7877 7.6301 6.7604 7.2467 1.0871 1.0923 1.0856 1.0856 1.0903 1.0902 1.0948 1.0949 1.0989 1.1002 1.1003 1.0926 1.0660
irintensity: 1.6357 1.0980 0.0936 0.6741 0.1059 0.3993 0.9699 1.7277 0.0225 0.9236 11.6103 0.5457 52.1050 70.9477 2.6610 0.0554 2.6432 8.4842 0.7096 0.9768 10.2658 1.2536 0.3342 1.5193 5.2907 9.1000 9.7440 8.9915 5.0504 28.3613 6.3375 3.1131 172.2554 1.4484 19.2318 20.1153 34.9612 2.9760 0.1928 35.5725 12.5142 1.4473 55.2267 1.2292 9.0209 2.0633 0.0468 0.1998 0.0821 18.3701 1.5346 0.4845 15.0012 31.2789 2.9348 16.5063 28.7937 4.7914 0.6818 0.7329 7.8240 1.7686 58.2553 171.1872 6.4924 91.1767 12.9827 9.5770 19.9000 19.8826 0.6050 28.1314 144.6933 25.6865 18.1653 102.1096 7.0299 10.5402 32.3323 0.1342 10.7561 33.4678 1.5909 1.4006 24.5673 0.8488 1.1835 9.2915 7.2539 13.6598 12.8644 27.1829 27.0786 6.7037 0.0416 10.5622
temp: 298.150 k
press: 1.00000 atm
elementType: 8 8 7 6 6 6 6 6 6 6 6 6 6 6 6 6 6 6 6 6 6 1 1 1 1 1 1 1 1 1 1 1 1 1
symmnumber: 1
zpe: 681156.5 jmol-1
zpe.correction: 0.259439 hartree
zpe.thermalcorrener: 0.275552 hartree
zpe.thermalcorrenthalpy: 0.276496 hartree
zpe.thermalcorrgfe: 0.213943 hartree
zpe.sumelectzpe: -897.471669 hartree
zpe.sumelectthermal: -897.455556 hartree
zpe.sumelectthermalent: -897.454612 hartree
zpe.sumelectthermalfe: -897.517165 hartree
dipole: 3.0112 0.2434 -1.4444
dipole: 3.3486
quadrupole: -127.7477 -106.2470 -117.3326
quadrupole: -2.6723 6.1420 1.5398
quadrupole: -10.6386 10.8621 -0.2235 -2.6723 6.1420 1.5398
hfenergy: -897.731108 hartree
pointgroup: C01 [X(C18H13N1O2)]
dipole: 1.1746595 -0.0754479 -0.5916875 debye
polarizability: 220.9590283|-2.2386007|235.7663663|-23.3961076|2.3386454|143.1729591 unknown
InChI: InChI=1S/C18H13NO2/c20-18(13-6-5-11-19-12-13)14-7-1-3-9-16(14)21-17-10-4-2-8-15(17)18/h1-12,20H
charge 0 multiplicity 1
34 atoms
O  2.405642 0.073356 -0.747156
O  -0.419161 0.007618 2.240341
N  -4.034402 0.110578 0.403509
C  -0.188084 0.009161 0.76746
C  0.617061 -1.231892 0.374263
C  0.551149 1.290988 0.367845
C  -1.596844 -0.022544 0.146218
C  1.836603 -1.15172 -0.338238
C  1.773796 1.269772 -0.343951
C  0.145109 -2.520092 0.736289
C  0.01373 2.555279 0.72235
C  2.570986 -2.306907 -0.689849
C  2.448846 2.458922 -0.700252
C  -1.748383 -0.167479 -1.25451
C  -2.770037 0.111455 0.929085
C  0.862026 -3.682363 0.397321
C  0.671361 3.75087 0.378733
C  2.080607 -3.572947 -0.322033
C  1.8947 3.70026 -0.338739
C  -3.042852 -0.170107 -1.812507
C  -4.154489 -0.026815 -0.948908
H  -0.795392 -2.587954 1.293397
H  -0.93079 2.580128 1.276122
H  0.467361 0.039428 2.683152
H  3.50914 -2.188001 -1.239892
H  3.392465 2.38507 -1.248842
H  -0.867617 -0.280154 -1.8973
H  -2.69357 0.214516 2.014059
H  0.480072 -4.666833 0.685979
H  0.239055 4.715907 0.661872
H  2.644502 -4.472182 -0.592023
H  2.412608 4.6256 -0.61248
H  -3.192953 -0.280597 -2.891048
H  -5.177945 -0.02212 -1.341567
