program: Gaussian 09
title: 000223287
version: EM64L-G09RevD.01
frameworkgroup: C1[X(C14H15NO2S)]
method: RPBEPBE
basis: SDD
operation: Freq
keyword: #p
keyword: freq=noraman
keyword: PBEPBE/SDD
title: #p freq=noraman PBEPBE/SDD
converged: YES YES NO NO
title: Mulliken charges:
elementType: S O O N C C C C C C C C C C C C C C H H H H H H H H H H H H H H H
charge: 0.995471 -0.540642 -0.545758 -0.550289 -0.433735 0.554754 0.440221 -0.362831 -0.385156 -0.448701 -0.424663 -0.710714 -0.236785 -0.235664 -0.225852 -0.249258 -0.242522 -0.244696 0.308301 0.311333 0.248917 0.253895 0.242416 0.264977 0.273116 0.282488 0.284273 0.228328 0.227457 0.228801 0.231395 0.230725 0.230398
chargesum: 0.00000
title: Mulliken charges with hydrogens summed into heavy atoms:
elementType: S O O N C C C C C C C C C C C C C C
charge: 0.995471 -0.540642 -0.545758 -0.238956 -0.125434 0.554754 0.440221 -0.113914 -0.131261 -0.206285 -0.159686 0.129163 -0.008457 -0.008207 0.002948 -0.017863 -0.011797 -0.014298
polarizability: 2.30557005e+02 1.07330420e+01 2.00209047e+02 -7.71804821e+00 -1.23175962e+01 1.33453947e+02
1716.lowfreq: -8.1823 -6.1042 0.0013 0.0018 0.0020 3.8228 13.2749 33.7449 42.8578
frequency: 12.9328 33.6447 42.8565 63.3829 74.2819 76.9419 153.2527 156.8302 168.4973 197.7259 208.4146 231.7218 249.9990 279.5275 300.6774 324.6046 356.1015 381.6404 401.4998 406.2249 443.2145 474.2119 558.1454 590.6773 596.1163 614.8790 617.3089 643.8690 704.2670 708.2239 732.7072 767.5703 777.4482 800.4746 841.1673 854.8186 860.5889 869.4214 899.8807 926.6008 935.4114 977.0314 978.7077 984.1045 988.7413 990.8179 996.4538 1001.1485 1002.7400 1026.6700 1032.0432 1033.8433 1081.5850 1096.4860 1172.7789 1174.8173 1182.0739 1188.6365 1203.6533 1210.0983 1238.4832 1252.7403 1314.0856 1330.0478 1334.1092 1369.3504 1379.0187 1384.5844 1412.4489 1416.7740 1434.9530 1442.1087 1482.2553 1486.4900 1590.0263 1594.5096 1610.8076 1612.4497 2946.2053 3037.1263 3109.6436 3120.2080 3122.7863 3125.7508 3135.6135 3138.2881 3147.2988 3150.0550 3164.1024 3164.5336 3184.8251 3195.0937 3344.7665
redmass: 4.1857 4.7679 5.0842 4.5975 4.8953 4.9138 1.5834 4.0282 2.2298 5.2044 5.2370 4.4946 4.2348 3.9731 4.6995 8.1337 7.3435 7.9593 2.8140 2.8748 3.7716 3.7996 3.7825 5.4286 4.4893 6.3185 6.3576 4.4476 1.6998 2.0800 2.5445 1.6434 1.9649 11.4224 3.2217 1.3580 1.3377 2.5713 2.8301 1.4597 1.4547 1.7167 1.4031 1.8125 2.8356 5.5748 1.3377 1.3789 1.8369 2.1700 2.2490 2.1144 1.6109 1.6637 1.0725 1.0739 2.8539 1.1172 1.4220 1.3017 1.1406 2.0255 1.1362 1.3050 1.3521 1.2586 5.7553 5.7227 1.0513 1.0518 2.2316 2.1497 2.2787 2.1468 5.7853 6.1483 5.9593 5.9476 1.0813 1.0248 1.0899 1.0862 1.0876 1.0856 1.0915 1.0907 1.0961 1.0952 1.1015 1.1014 1.1075 1.1076 1.0745
irintensity: 0.9955 1.9246 3.5363 1.4777 1.0813 1.4437 0.6272 7.8404 4.5590 1.5917 1.6504 2.6952 0.8477 9.6133 6.0500 16.0770 48.5270 24.5200 0.0316 0.0324 11.1094 9.2356 43.8315 7.7972 30.6865 0.7202 1.9055 24.4958 63.0510 30.8497 46.9179 40.7715 116.5814 74.4695 23.7785 1.1969 2.9408 39.6606 27.2113 4.0162 0.6834 52.0418 2.0551 0.3013 1.5063 2.2027 0.7501 0.3541 1.9695 12.3854 4.3352 42.6469 8.7665 1.4615 0.1915 0.3581 4.8425 1.0273 8.3362 6.3178 9.0134 13.3025 4.0188 3.3963 1.8774 4.9325 0.7621 0.1615 11.5222 13.2135 11.9633 11.4824 6.0259 24.2682 1.2776 0.8150 5.1048 2.5994 10.4615 0.0785 0.6644 4.8716 1.8083 1.0932 10.9299 7.2139 35.4426 29.4828 33.1639 23.8958 0.5321 0.3063 23.4983
temp: 298.150 k
press: 1.00000 atm
elementType: 16 8 8 7 6 6 6 6 6 6 6 6 6 6 6 6 6 6 1 1 1 1 1 1 1 1 1 1 1 1 1 1 1
symmnumber: 1
zpe: 672491.1 jmol-1
zpe.correction: 0.256138 hartree
zpe.thermalcorrener: 0.273656 hartree
zpe.thermalcorrenthalpy: 0.274600 hartree
zpe.thermalcorrgfe: 0.208437 hartree
zpe.sumelectzpe: -1144.267919 hartree
zpe.sumelectthermal: -1144.250401 hartree
zpe.sumelectthermalent: -1144.249457 hartree
zpe.sumelectthermalfe: -1144.315620 hartree
dipole: -3.2013 -1.8071 -2.0970
dipole: 4.2321
quadrupole: -117.3530 -95.4535 -116.1532
quadrupole: -2.9752 -4.8953 0.7577
quadrupole: -7.6997 14.1997 -6.5000 -2.9752 -4.8953 0.7577
hfenergy: -1144.524057 hartree
pointgroup: C01 [X(C14H15N1O2S1)]
dipole: 1.5118084 0.1339677 -0.6847461 debye
polarizability: 230.291601|-5.6874014|197.0225656|21.0924761|8.7559196|136.9058318 unknown
InChI: InChI=1S/C14H15NO2S/c1-18(16,17)15-14(12-8-4-2-5-9-12)13-10-6-3-7-11-13/h2-11,14-15H,1H3
charge 0 multiplicity 1
33 atoms
S  -1.610567 2.573121 0.064305
O  -1.658724 2.417195 1.686435
O  -2.961402 2.450278 -0.847646
N  -0.274912 1.380176 -0.555496
C  0.02537 0.263015 0.402428
C  1.542192 0.055789 0.35809
C  -0.813853 -1.008877 0.170704
C  2.15813 -0.574127 -0.753793
C  -0.314178 -2.276006 0.570346
C  2.35642 0.537576 1.411199
C  -2.126221 -0.933931 -0.364375
C  -0.775086 4.227207 -0.343796
C  3.561173 -0.713397 -0.812538
C  -1.098138 -3.441118 0.424768
C  3.761825 0.393998 1.358466
C  -2.908794 -2.10203 -0.512653
C  4.368634 -0.22944 0.244282
C  -2.399089 -3.360334 -0.12271
H  -0.238873 0.66086 1.406933
H  -0.62817 1.036955 -1.471762
H  1.537405 -0.965988 -1.568406
H  0.692896 -2.351629 0.994306
H  1.888334 1.025179 2.275158
H  -2.569147 0.028877 -0.650411
H  -0.662417 4.260635 -1.435508
H  -1.453909 5.004582 0.03366
H  0.190668 4.212812 0.176805
H  4.02555 -1.200079 -1.67758
H  -0.693242 -4.409952 0.738467
H  4.37982 0.765233 2.183628
H  -3.920772 -2.022467 -0.92513
H  5.457878 -0.340377 0.200364
H  -3.008603 -4.263534 -0.237637
