program: Gaussian 09
title: 000223286
version: EM64L-G09RevD.01
frameworkgroup: C1[X(C14H24O4)]
method: RPBEPBE
basis: SDD
operation: Freq
keyword: #pfreq=noraman
keyword: PBEPBE/SDD
title: #p freq=noraman PBEPBE/SDD
converged: YES YES NO NO
title: Mulliken charges:
elementType: O O O O C C C C C C C C C C C C C C H H H H H H H H H H H H H H H H H H H H H H H H
charge: -0.232535 -0.233921 -0.207678 -0.198263 0.076489 0.317795 -0.429575 -0.401201 -0.445190 -0.402579 0.151323 0.144508 -0.358687 -0.358008 -0.710148 -0.708014 -0.698631 -0.695268 0.222925 0.208773 0.202308 0.238555 0.251549 0.237320 0.200649 0.248630 0.226256 0.220455 0.211505 0.235948 0.230216 0.234289 0.223161 0.260092 0.226183 0.214906 0.210891 0.210832 0.223595 0.212687 0.212605 0.225255
chargesum: 0.00000
title: Mulliken charges with hydrogens summed into heavy atoms:
elementType: O O O O C C C C C C C C C C C C C C
charge: -0.232535 -0.233921 -0.207678 -0.198263 0.076489 0.317795 0.002123 0.039662 0.043679 0.046699 0.151323 0.144508 0.088024 0.089444 -0.022483 -0.006832 -0.053312 -0.044721
polarizability: 1.84745209e+02 -2.16038581e-01 1.58662558e+02 1.92617460e-01 8.25748098e-01 1.41992884e+02
1716.lowfreq: -11.1415 -10.6219 -7.9827 -0.0007 0.0002 0.0005 29.9674 38.3937 42.2415
frequency: 29.9010 38.2811 42.1832 58.8275 70.0613 79.8567 85.9667 95.2199 105.6096 151.7664 166.8167 178.3220 200.8189 213.2735 218.9379 233.6849 237.2649 262.2230 265.5606 283.0900 306.0222 314.2834 329.0387 343.5870 368.9202 375.9705 439.2862 446.7874 469.1427 554.7683 572.6836 637.7469 658.9384 671.2594 693.5456 741.9496 746.9214 765.5862 787.8331 831.9755 838.8074 857.4200 894.2310 894.4289 906.6594 916.3875 919.7532 933.8180 1017.8973 1020.6660 1041.0602 1042.6224 1052.7427 1060.6460 1079.5205 1081.6290 1092.9803 1104.5686 1120.0986 1136.0703 1158.4349 1182.2957 1191.1921 1194.2016 1237.9214 1256.0031 1275.8086 1289.2509 1295.7931 1300.3846 1303.3525 1308.2792 1327.6206 1337.2205 1353.4604 1361.8911 1391.7020 1396.2177 1399.3364 1402.3168 1445.7351 1451.8806 1457.9135 1470.8840 1474.6380 1475.4898 1476.5998 1478.0611 1479.8186 1480.6995 1486.6822 1487.6797 1487.9538 1493.7619 1635.9651 1670.3231 2974.4762 2975.9112 2981.8992 2982.7631 2985.3924 2994.8589 2995.2624 2996.2284 3004.0909 3018.2692 3033.3907 3041.5557 3046.3945 3054.1867 3060.2717 3068.2436 3077.4430 3077.9637 3079.8218 3080.6220 3081.3826 3082.5974 3097.1686 3105.9750
redmass: 4.1151 4.3048 3.9318 2.2112 2.5563 2.3223 1.8428 2.6183 2.1608 3.1344 3.6427 2.6135 3.8202 1.2215 2.1591 1.1441 1.1492 1.6872 2.6759 2.8064 2.7020 2.6433 3.5387 3.5153 5.0874 4.7221 4.2842 8.2099 5.6541 4.3006 4.0792 4.0596 5.0545 5.6686 5.3150 1.3338 1.1275 1.3237 1.2706 5.1891 1.9479 1.3508 2.5903 2.2280 1.7313 1.9785 2.2529 2.7668 2.5270 2.3909 2.2127 2.3273 2.4108 2.0304 2.0695 2.1486 3.0333 2.0465 2.5328 2.4114 2.3765 4.3038 2.6744 2.2120 1.3582 1.3270 1.1638 1.2477 1.2532 1.1864 1.3416 1.3068 1.3380 1.3761 1.4988 1.6457 1.2079 1.2140 1.2029 1.2053 1.0811 1.0793 1.0851 1.0760 1.0526 1.0474 1.0459 1.0421 1.0447 1.0432 1.0806 1.0858 1.0437 1.0515 12.4371 11.4999 1.0360 1.0362 1.0405 1.0569 1.0597 1.0381 1.0594 1.0601 1.0595 1.0604 1.0985 1.0991 1.0997 1.1011 1.1010 1.1001 1.1014 1.0996 1.0994 1.1025 1.0987 1.0988 1.1031 1.1004
irintensity: 0.1060 2.9191 0.0967 0.0403 0.0707 0.2037 0.2179 0.1731 0.3561 1.4480 4.3872 0.4909 0.9645 1.1432 6.2708 0.0840 0.1661 1.0834 0.8479 0.2226 1.8344 2.5418 6.4418 2.8595 3.8631 5.0710 1.3335 1.4792 2.1114 1.9355 4.2349 1.8501 13.1703 5.2220 4.4724 8.8102 4.9906 2.0486 2.1311 10.9680 58.6253 1.0443 36.4581 62.5134 15.0775 18.4980 31.7407 13.9869 24.6453 7.2269 8.8841 1.9536 4.3802 2.2507 15.2689 4.8104 13.9818 36.2239 216.2212 26.3346 31.0767 303.5791 128.9686 20.7596 6.8491 12.9601 0.7791 5.5714 11.7016 3.9278 10.0138 26.2595 9.3088 8.4493 3.4896 12.5154 11.7672 8.3612 20.1716 18.8372 3.1331 15.8803 3.1975 2.3609 11.4780 11.4254 4.2806 12.9046 10.8616 15.0725 7.9748 14.4382 14.1076 10.9944 292.8241 125.3349 43.7686 31.9828 21.7528 22.1940 10.7600 17.0155 38.2969 5.6546 43.3700 14.5860 2.4489 2.4590 10.6977 2.3706 0.6157 6.5872 50.1938 70.8783 23.4409 84.9743 27.9667 38.7652 23.3668 21.1081
temp: 298.150 k
press: 1.00000 atm
elementType: 8 8 8 8 6 6 6 6 6 6 6 6 6 6 6 6 6 6 1 1 1 1 1 1 1 1 1 1 1 1 1 1 1 1 1 1 1 1 1 1 1 1
symmnumber: 1
zpe: 938463.6 jmol-1
zpe.correction: 0.357442 hartree
zpe.thermalcorrener: 0.378784 hartree
zpe.thermalcorrenthalpy: 0.379729 hartree
zpe.thermalcorrgfe: 0.306806 hartree
zpe.sumelectzpe: -847.354738 hartree
zpe.sumelectthermal: -847.333395 hartree
zpe.sumelectthermalent: -847.332451 hartree
zpe.sumelectthermalfe: -847.405373 hartree
dipole: 1.5111 1.5599 -0.3318
dipole: 2.1970
quadrupole: -101.4096 -104.4352 -129.4339
quadrupole: 0.1963 -3.7740 -5.5145
quadrupole: 10.3500 7.3243 -17.6744 0.1963 -3.7740 -5.5145
hfenergy: -847.7121795 hartree
pointgroup: C01 [X(C14H24O4)]
dipole: 0.6338663 -0.5680202 0.1506027 debye
polarizability: 184.5881675|2.016968|158.8452086|0.2933386|0.5012622|141.9672753 unknown
InChI: InChI=1S/C14H24O4/c1-5-9-14(10-6-2)17-11(15)13(7-3,8-4)12(16)18-14/h5-10H2,1-4H3
charge 0 multiplicity 1
42 atoms
O  0.314954 0.551698 1.306602
O  0.716371 0.109326 -1.073734
O  -1.789872 0.726902 2.139809
O  -0.975838 -0.417423 -2.502095
C  -1.658258 -0.058043 -0.178603
C  1.265425 -0.001153 0.303454
C  2.507654 0.893354 0.344749
C  1.513048 -1.484741 0.644762
C  -2.733206 1.001271 -0.622519
C  -2.330912 -1.481865 -0.025155
C  -1.077923 0.409241 1.169058
C  -0.637453 -0.167429 -1.331171
C  2.227331 2.392308 0.102128
C  2.531613 -2.199098 -0.27251
C  -2.157457 2.401563 -0.917704
C  -3.557562 -1.558748 0.905742
C  3.529263 3.221104 0.112508
C  2.613919 -3.708302 0.041004
H  3.212871 0.520711 -0.421116
H  2.987728 0.752557 1.332381
H  0.545782 -2.024547 0.600559
H  1.850757 -1.527839 1.697786
H  -3.477457 1.072058 0.188252
H  -3.231839 0.599472 -1.523052
H  -1.565708 -2.202513 0.326152
H  -2.613485 -1.794032 -1.047938
H  1.537674 2.765302 0.881496
H  1.714406 2.511078 -0.870879
H  3.533705 -1.746486 -0.146954
H  2.242151 -2.048433 -1.329481
H  -1.663558 2.834188 -0.028237
H  -1.428404 2.3796 -1.747999
H  -2.971648 3.088107 -1.210203
H  -3.330002 -1.18713 1.91838
H  -4.408985 -0.976923 0.51288
H  -3.885713 -2.611328 0.985608
H  4.05417 3.129771 1.082248
H  4.224476 2.886322 -0.6805
H  3.318581 4.292539 -0.055596
H  2.909563 -3.884789 1.092373
H  1.638652 -4.204286 -0.122346
H  3.356482 -4.207766 -0.606639
