program: Gaussian 09
title: 000223279
version: EM64L-G09RevD.01
frameworkgroup: C1[X(C10H13NO4)]
method: RPBEPBE
basis: SDD
operation: Freq
keyword: #p
keyword: freq=noraman
keyword: PBEPBE/SDD
title: #p freq=noraman PBEPBE/SDD
converged: YES YES NO NO
title: Mulliken charges:
elementType: O O O O N C C C C C C C C C C H H H H H H H H H H H H H
charge: -0.323628 -0.451505 -0.246977 -0.261892 -0.444998 0.220074 -0.024898 0.057573 0.321900 -0.789535 -0.756407 0.172467 0.084275 -0.208929 -0.677450 0.341926 0.265120 0.243372 0.243451 0.260749 0.206847 0.260798 0.229417 0.230067 0.216354 0.226699 0.226432 0.378698
chargesum: 0.00000
title: Mulliken charges with hydrogens summed into heavy atoms:
elementType: O O O O N C C C C C C C C C C
charge: -0.323628 -0.072807 -0.246977 -0.261892 -0.103072 0.220074 -0.024898 0.057573 0.321900 -0.037592 -0.028013 0.172467 0.084275 0.250555 -0.007965
polarizability: 2.01676783e+02 1.73152512e+00 1.43915481e+02 1.25551499e-01 -5.86865038e-02 7.14581573e+01
1716.lowfreq: -6.6495 -6.3751 -0.0008 -0.0005 0.0002 4.0509 40.4592 59.0032 64.4534
frequency: 40.0760 58.9583 64.4112 81.1155 88.0274 98.1261 105.8805 119.9796 166.8937 173.1697 223.4050 246.4194 260.7636 261.1397 292.8676 324.6081 348.2879 359.9486 443.0809 462.9688 567.5162 570.1039 595.6096 618.1043 650.9169 674.7286 709.1696 727.4846 738.1173 753.5413 800.2650 807.7294 850.8931 985.2941 990.5143 1004.7495 1038.7959 1039.3027 1045.0648 1061.5443 1111.3538 1137.8383 1150.9955 1197.9973 1239.5697 1249.8658 1288.9062 1334.3512 1361.6957 1401.7417 1404.3457 1409.0511 1431.7710 1446.7469 1447.2853 1465.7358 1466.5798 1468.4751 1475.6990 1488.1023 1494.1695 1513.5738 1568.3016 1637.3107 1655.7689 2993.9015 2994.3401 2994.4618 3010.2491 3067.2334 3067.3786 3085.0536 3091.1112 3092.4141 3104.4788 3119.4167 3519.2351 3580.8346
redmass: 3.5851 3.5610 3.7573 4.1721 2.2006 1.5834 1.0728 2.5500 3.0496 6.0752 3.7384 1.5819 2.6977 2.9664 4.8231 5.9069 4.2728 3.9625 6.2683 5.8361 1.3270 4.3178 3.6755 5.6513 3.2864 4.6476 1.1471 9.3769 6.8270 7.0566 1.1025 4.5765 3.6056 2.2233 2.2791 2.5013 3.8166 1.4665 1.5291 2.4964 2.2028 1.4663 2.3657 3.0824 1.6014 1.1309 3.4463 3.4790 1.5491 1.2787 1.2614 1.2678 4.4641 1.0438 1.3262 1.0405 1.3364 1.0458 1.0574 1.0899 2.5642 4.9942 5.6154 9.5546 8.4204 1.0368 1.0367 1.0367 1.0582 1.0998 1.1022 1.0970 1.0984 1.1004 1.1028 1.1006 1.0639 1.0809
irintensity: 0.0016 0.6496 0.0850 0.4453 1.4054 0.4570 0.2243 3.4409 0.0565 1.0916 3.6595 2.1218 10.0425 1.4623 13.3177 4.3861 0.0800 6.8379 5.1905 8.7646 88.5000 22.0710 9.5503 2.1749 37.5556 16.5462 106.5957 2.3110 6.6079 13.1889 3.9839 41.5947 28.3899 157.6247 136.2719 128.2116 289.3093 1.7729 9.7966 78.6281 1.5031 5.3794 161.6005 27.2338 238.4097 0.0008 18.6043 91.6266 7.6904 34.9640 20.6505 2.4644 82.1142 14.4702 121.0580 12.3339 36.9730 14.1963 6.5602 11.8895 4.3898 51.5684 45.4838 396.3445 385.0781 19.1372 29.2656 3.9467 23.1483 0.8393 15.9354 6.3690 33.7629 16.0461 48.9283 3.4339 38.7016 94.3193
temp: 298.150 k
press: 1.00000 atm
elementType: 8 8 8 8 7 6 6 6 6 6 6 6 6 6 6 1 1 1 1 1 1 1 1 1 1 1 1 1
symmnumber: 1
zpe: 574308.7 jmol-1
zpe.correction: 0.218743 hartree
zpe.thermalcorrener: 0.234985 hartree
zpe.thermalcorrenthalpy: 0.235929 hartree
zpe.thermalcorrgfe: 0.174193 hartree
zpe.sumelectzpe: -743.421660 hartree
zpe.sumelectthermal: -743.405417 hartree
zpe.sumelectthermalent: -743.404473 hartree
zpe.sumelectthermalfe: -743.466210 hartree
dipole: -1.8873 5.1660 -0.0046
dipole: 5.5000
quadrupole: -76.3549 -89.4429 -88.1054
quadrupole: 1.7648 -0.0224 -0.0061
quadrupole: 8.2795 -4.8085 -3.4710 1.7648 -0.0224 -0.0061
hfenergy: -743.6404026 hartree
pointgroup: C01 [X(C10H13N1O4)]
dipole: 0.7084987 -2.0433528 -0.07109 debye
polarizability: 201.7170589|0.7811426|143.7909251|-0.4230126|2.4487507|71.5424367 unknown
InChI: InChI=1S/C10H13NO4/c1-4-15-10(14)8-5(2)7(9(12)13)6(3)11-8/h11-12H,4H2,1-3H3
charge 0 multiplicity 1
28 atoms
O  2.792767 -0.348912 -0.005498
O  -3.966178 -0.923263 -0.002788
O  2.302817 1.946738 0.071708
O  -3.712292 1.383537 0.08003
N  0.237325 -1.100848 -0.02345
C  -0.700169 0.974334 0.051504
C  -1.737728 -0.036757 0.02083
C  0.525277 0.279178 0.022743
C  -1.117413 -1.321322 -0.025542
C  -0.883375 2.465156 0.103638
C  -1.688604 -2.707728 -0.07099
C  1.902067 0.755728 0.033769
C  -3.168614 0.248813 0.0367
C  4.243771 -0.00575 0.000391
C  5.013736 -1.322575 -0.022473
H  0.971924 -1.808924 -0.04989
H  0.091379 2.975948 0.117665
H  -1.47248 2.817242 -0.762212
H  -1.465832 2.756305 0.996228
H  -2.334302 -2.838627 -0.956068
H  -0.887277 -3.46749 -0.097973
H  -2.331331 -2.897579 0.805487
H  4.45636 0.622984 -0.883199
H  4.456645 0.592385 0.904832
H  6.100104 -1.119327 -0.018755
H  4.774946 -1.936247 0.863337
H  4.775554 -1.905586 -0.928975
H  -4.918677 -0.634813 0.011353
