program: Gaussian 09
title: 000223274
version: EM64L-G09RevD.01
frameworkgroup: C1[X(C15H16N4O4)]
method: RPBEPBE
basis: SDD
operation: Freq
keyword: #p
keyword: freq=noraman
keyword: PBEPBE/SDD
title: #p freq=noraman PBEPBE/SDD
converged: YES YES NO NO
title: Mulliken charges:
elementType: O O O O N N N N C C C C C C C C C C C C C C C H H H H H H H H H H H H H H H H
charge: -0.222383 -0.210833 -0.206083 -0.213543 -0.201484 -0.187767 -0.004532 -0.009500 0.144771 -0.505570 -0.501968 0.180652 0.164606 -0.524047 -0.521252 0.197158 0.211415 -0.378666 -0.374882 -0.414960 -0.413008 -0.145727 -0.149039 0.280886 0.241079 0.241684 0.246333 0.270576 0.252168 0.276989 0.268236 0.277472 0.271750 0.273071 0.270621 0.274554 0.279342 0.279303 0.282578
chargesum: 0.00000
title: Mulliken charges with hydrogens summed into heavy atoms:
elementType: O O O O N N N N C C C C C C C C C C C C C C C
charge: -0.222383 -0.210833 -0.206083 -0.213543 -0.201484 -0.187767 -0.004532 -0.009500 0.144771 0.016395 -0.013951 0.180652 0.164606 -0.001304 0.023973 0.197158 0.211415 0.170556 0.168809 0.138937 0.148873 -0.145727 -0.149039
polarizability: 2.30658901e+02 -9.01789163e+00 1.77482653e+02 -5.58656598e+00 3.44609987e+00 1.57167926e+02
1716.lowfreq: -7.8351 -5.5263 -0.0006 0.0006 0.0007 4.8600 15.5928 26.6803 29.8614
frequency: 15.1888 26.5654 29.7479 34.2095 52.2426 57.6061 60.5909 61.6685 117.8697 123.8130 135.7968 166.8014 172.5821 181.0510 191.9934 236.6294 263.0581 307.9084 326.5180 343.6752 349.5787 355.2254 385.2735 387.3213 414.4226 433.1793 450.8064 455.5056 483.0467 493.2063 505.1232 533.5984 564.6081 570.9801 592.0619 629.5770 641.9731 676.8194 696.4270 739.4837 749.8960 757.4061 768.9398 844.4818 888.8001 905.3749 926.4947 936.4652 947.2138 947.9691 970.9943 1014.6360 1027.8119 1032.2505 1039.2316 1046.1168 1083.1917 1085.2760 1098.6523 1116.3211 1143.9256 1161.2725 1168.0310 1194.9326 1211.6822 1243.6364 1249.0514 1273.3010 1277.8238 1287.2382 1288.2633 1296.7560 1306.1294 1322.3763 1334.8860 1342.9153 1345.1966 1355.1585 1357.9858 1374.3656 1376.1860 1441.0269 1442.5007 1443.9853 1449.4372 1450.4831 1452.6396 1473.4267 1482.5474 1567.3949 1585.4308 1630.5083 1635.5346 2203.3899 2204.8140 2994.2668 2998.1381 3008.0569 3011.8015 3012.5879 3017.2563 3059.9542 3061.2538 3061.5995 3068.1415 3072.2824 3075.9359 3082.7807 3084.5958 3133.2249 3135.1001
redmass: 7.3851 6.7618 5.4849 9.3188 8.6425 3.5464 3.3803 4.6250 6.9655 7.6153 8.7606 7.6109 3.5227 5.5059 3.6301 3.1920 3.5849 2.5847 4.4046 4.0459 3.1549 4.4745 3.4150 3.4887 5.7437 5.4358 6.8091 4.9748 5.8773 5.3317 5.1959 5.2010 3.3761 4.9589 3.7148 5.3240 6.5681 4.8190 4.1119 3.5733 2.1490 1.4018 1.6497 2.1762 2.5703 3.0232 2.6465 2.5707 4.4798 4.2713 2.5199 2.5686 3.3312 3.4336 2.4831 2.5548 2.6834 2.4286 2.5369 2.8419 2.5195 1.9616 1.8692 1.5431 1.4803 1.3584 1.4603 1.4740 1.4810 1.3389 1.3241 4.2284 4.6328 1.5303 1.3969 1.3432 1.3982 1.6147 1.5962 1.3481 1.3507 1.0999 1.0950 1.0954 1.0922 1.0896 1.0774 1.0867 1.0816 10.6138 11.3795 10.0586 10.3298 12.4451 12.4503 1.0674 1.0626 1.0582 1.0639 1.0584 1.0614 1.0588 1.0921 1.0655 1.1025 1.1023 1.0979 1.0978 1.0982 1.1076 1.1077
irintensity: 0.7175 1.0363 0.7189 0.8565 0.8949 4.1198 7.9107 1.5536 10.6803 15.1309 0.3808 1.9714 4.6295 0.6288 1.6405 0.4887 0.8336 3.4675 7.1691 6.4984 3.4064 18.2532 4.4897 15.0851 7.2527 8.1625 2.8713 8.9714 18.4323 13.6604 3.1734 2.0776 13.1436 10.0832 23.3699 3.3603 2.5896 12.7549 6.8723 0.3128 18.2714 4.0705 12.2533 4.6616 12.9524 1.7330 8.2558 5.6273 2.9842 1.0741 19.3480 3.3341 27.3025 7.5088 47.4370 30.2793 41.7131 0.6096 0.8294 3.0141 16.1021 227.6335 149.0737 10.8969 7.1841 4.8745 19.5501 20.7988 58.0782 1.3972 1.5383 198.7423 160.4052 15.2723 23.6204 34.1477 30.0068 84.8302 17.4333 11.2842 6.3762 46.9627 8.8137 6.7153 25.1999 35.6098 15.7526 7.0698 18.8935 446.2933 226.1273 203.7928 20.6913 12.8103 10.0978 5.3895 21.9770 1.9772 5.1735 1.3306 14.6595 5.7315 11.7291 19.3665 0.9062 0.4988 9.0369 5.1265 9.2801 0.0721 0.0580
temp: 298.150 k
press: 1.00000 atm
elementType: 8 8 8 8 7 7 7 7 6 6 6 6 6 6 6 6 6 6 6 6 6 6 6 1 1 1 1 1 1 1 1 1 1 1 1 1 1 1 1
symmnumber: 1
zpe: 781774.4 jmol-1
zpe.correction: 0.297762 hartree
zpe.thermalcorrener: 0.319743 hartree
zpe.thermalcorrenthalpy: 0.320687 hartree
zpe.thermalcorrgfe: 0.243066 hartree
zpe.sumelectzpe: -1099.436336 hartree
zpe.sumelectthermal: -1099.414355 hartree
zpe.sumelectthermalent: -1099.413411 hartree
zpe.sumelectthermalfe: -1099.491032 hartree
dipole: 1.8674 -8.5129 -0.1250
dipole: 8.7162
quadrupole: -196.9893 -145.3888 -139.3719
quadrupole: 0.6106 -6.2696 -0.7845
quadrupole: -36.4060 15.1946 21.2114 0.6106 -6.2696 -0.7845
hfenergy: -1099.7340982 hartree
pointgroup: C01 [X(C15H16N4O4)]
dipole: 0.6861277 3.3598283 0.0167531 debye
polarizability: 229.9199974|9.7550945|177.8666663|7.932645|3.5229079|157.5228157 unknown
InChI: InChI=1S/C15H16N4O4/c16-7-1-9-18-11(20)3-5-15(13(18)22)6-4-12(21)19(14(15)23)10-2-8-17/h1-6,9-10H2
charge 0 multiplicity 1
39 atoms
O  0.496002 -0.786648 -0.861627
O  -1.35289 0.123042 1.892436
O  4.24433 1.410715 0.806473
O  -3.342765 0.796012 -2.248371
N  2.355158 0.352994 -0.054586
N  -2.365927 0.586159 -0.144868
N  4.922842 -3.818152 -0.581442
N  -5.688663 -2.869386 0.970213
C  0.033982 1.33855 0.278201
C  0.669797 2.04807 1.500867
C  -0.262295 2.335898 -0.883579
C  0.958949 0.216392 -0.248121
C  -1.268535 0.634582 0.743435
C  2.098897 2.523145 1.192018
C  -1.079324 1.6806 -2.008372
C  2.995895 1.417319 0.661371
C  -2.345172 1.005578 -1.51226
C  3.226614 -0.718628 -0.610458
C  -3.598715 -0.093007 0.338237
C  3.385196 -1.881239 0.409955
C  -3.508662 -1.624038 0.079334
C  4.23347 -2.954999 -0.13107
C  -4.709085 -2.320361 0.567099
H  0.668973 1.349331 2.35546
H  0.041109 2.9091 1.791233
H  0.679331 2.739502 -1.296722
H  -0.823023 3.191312 -0.459634
H  2.588626 2.929013 2.092655
H  2.09828 3.341467 0.444835
H  -0.485992 0.907842 -2.533118
H  -1.383408 2.419047 -2.769256
H  4.208092 -0.271158 -0.828063
H  2.761398 -1.092388 -1.5351
H  -4.453257 0.332731 -0.208802
H  -3.696476 0.102433 1.416684
H  3.840799 -1.500212 1.342327
H  2.391891 -2.299143 0.656132
H  -3.39792 -1.81041 -1.004289
H  -2.619419 -2.035366 0.590372
