program: Gaussian 09
title: 000223259
version: EM64L-G09RevD.01
frameworkgroup: C1[X(C7H8Br2N2)]
method: RPBEPBE
basis: SDD
operation: Freq
keyword: #p
keyword: freq=noraman
keyword: PBEPBE/SDD
title: #p freq=noraman PBEPBE/SDD
converged: NO YES NO NO
title: Mulliken charges:
elementType: Br Br N N C C C C C C C H H H H H H H H
charge: -0.012820 -0.021613 -0.087249 -0.636788 0.627529 0.213882 -0.418757 -0.471841 0.208286 -0.791878 -0.781726 0.241593 0.261399 0.261315 0.252083 0.249013 0.248993 0.328853 0.329726
chargesum: 0.00000
title: Mulliken charges with hydrogens summed into heavy atoms:
elementType: Br Br N N C C C C C C C
charge: -0.012820 -0.021613 -0.087249 0.021791 0.627529 0.213882 -0.418757 -0.471841 0.208286 -0.027571 -0.031636
polarizability: 1.92138530e+02 4.52301997e+00 1.36680013e+02 1.17857086e-02 -6.50091515e-03 5.43630928e+01
1716.lowfreq: -4.2992 -2.7361 -0.0007 -0.0004 -0.0003 4.7198 68.6363 74.4298 116.5806
frequency: 68.6262 74.4269 116.5800 141.9077 145.1488 187.5996 213.6075 230.2469 271.7984 273.6322 319.4018 337.2386 357.6765 439.3551 513.0212 530.9618 542.9288 549.6551 601.4192 615.2301 627.8806 740.3243 907.8257 968.0864 999.1157 1036.9033 1038.4465 1045.1444 1068.3992 1084.6451 1314.3908 1356.1981 1366.1519 1395.9846 1400.1605 1426.3918 1462.3150 1462.5970 1466.6301 1472.9433 1519.3021 1563.4413 1615.1745 2991.4596 2995.3238 3069.9534 3071.9337 3124.4337 3126.1561 3550.6281 3704.1365
redmass: 4.3766 3.4374 1.1239 1.0506 23.1639 3.1697 5.2745 11.3887 5.1416 5.5598 2.9325 6.7158 3.2715 1.1658 1.1058 6.5863 2.9509 4.2670 5.0697 6.7834 4.9278 8.3509 2.9828 2.1366 5.4527 1.8735 1.5102 1.5329 2.6064 2.1225 6.8524 6.4117 3.4722 1.3226 1.3030 2.1871 1.0477 1.1247 1.0432 1.5139 6.9939 2.8759 1.6876 1.0378 1.0386 1.0970 1.0970 1.0992 1.0978 1.0444 1.1052
irintensity: 0.3733 0.0018 0.8240 1.0778 0.0242 10.9216 0.9185 7.2029 5.6193 0.0817 1.5911 0.5000 0.3131 229.4871 64.3929 0.9974 1.3652 8.1798 7.9554 55.3775 3.2319 13.4429 10.8801 97.2366 37.1789 0.0563 6.1802 5.6262 8.2259 11.1901 16.4649 20.9511 13.3286 47.0118 18.7485 28.1910 17.5797 23.4830 13.3599 116.9696 17.0108 30.6524 444.0114 12.5532 7.1604 13.6945 7.4271 10.1695 8.1051 97.6997 47.1137
temp: 298.150 k
press: 1.00000 atm
elementType: 35 35 7 7 6 6 6 6 6 6 6 1 1 1 1 1 1 1 1
symmnumber: 1
zpe: 361887.9 jmol-1
zpe.correction: 0.137836 hartree
zpe.thermalcorrener: 0.149925 hartree
zpe.thermalcorrenthalpy: 0.150869 hartree
zpe.thermalcorrgfe: 0.098162 hartree
zpe.sumelectzpe: -407.170370 hartree
zpe.sumelectthermal: -407.158281 hartree
zpe.sumelectthermalent: -407.157337 hartree
zpe.sumelectthermalfe: -407.210043 hartree
dipole: 1.3116 0.6663 -0.0009
dipole: 1.4712
quadrupole: -78.2606 -77.0983 -86.6132
quadrupole: 3.9149 -0.0062 -0.0084
quadrupole: 2.3968 3.5590 -5.9558 3.9149 -0.0062 -0.0084
hfenergy: -407.3082056 hartree
pointgroup: C01 [X(C7H8Br2N2)]
dipole: 0.5088036 -0.2747931 -0.0247345 debye
dipolederiv: -0.6282458 0.2944714 0.0290969 0.3354073 -0.2462354 -0.0167156 0.0291647 -0.0148882 -0.0333824 -0.7375391 -0.3061897 0.0273984 -0.3076368 -0.2479155 0.0115196 0.0278921 0.0115497 -0.0446304 -0.7492735 0.3855741 0.026076 -0.1459497 -0.5946628 0.003228 0.0206287 -0.0206496 -0.2525947 -1.0692026 0.7280449 0.0237624 0.6892545 -0.7212698 -0.0308067 0.024338 -0.0335178 -0.7140109 0.0280124 0.0151002 0.0024908 -0.0787187 0.2693411 0.0050586 0.0015813 0.0006508 0.0833527 0.3720277 0.1998759 -0.0110206 0.3100736 0.5329639 -0.0091443 -0.0099258 -0.0040473 0.0826785 0.6277879 -0.5804639 -0.0411493 -0.7966076 -0.1107533 0.0354423 -0.0432931 0.0258744 -0.1870774 0.7973244 0.4913842 -0.037193 1.0229683 -0.1718393 -0.0454167 -0.0322759 -0.0222394 -0.1558395 0.9179186 -1.0323791 -0.0415095 -0.843964 0.7813292 0.0431381 -0.0394323 0.0518173 0.2338404 0.0321735 0.0940077 0.0012383 0.01682 -0.1930121 -0.0027737 0.0006178 -0.0051315 0.0398572 -0.244222 -0.1444111 0.0108002 -0.0969068 0.0135826 0.00395 0.0113004 0.0062877 0.0346408 -0.0488472 -0.1249317 0.0049474 -0.0343633 0.0825542 0.0010887 0.0062147 0.0046671 0.1157355 0.0633367 0.0321052 -0.0915092 0.0200172 0.042515 0.0252817 -0.0740843 0.0576243 -0.0064953 0.0759317 0.0261057 0.0857962 0.0166799 0.0446775 -0.0255673 0.0677334 -0.0590826 -0.0203602 0.1090922 0.0965647 0.0015029 -0.0063411 -0.0919969 -0.0021368 0.0003196 -0.0067143 0.1182341 0.0174468 -0.0280076 0.0750161 -0.000799 0.0739553 -0.0596291 0.0981431 -0.0172264 -0.0373403 0.0019498 -0.0244175 -0.0789046 0.0068894 0.0720999 0.0618295 -0.1013331 0.0218195 -0.0196709 0.2431966 -0.0611692 0.005398 -0.0306507 0.2190317 -0.0004653 0.0052035 0.0013045 0.382608 0.191132 -0.0612642 0.0077625 -0.0761727 0.2456345 0.002119 0.0072072 0.0019018 0.3804549 unknown
polarizability: 191.6105174|-5.8435248|136.9287773|-6.0997814|1.078924|54.6423408 unknown
InChI: InChI=1S/C7H8Br2N2/c1-3-5(8)4(2)11-7(10)6(3)9/h10H2,1-2H3
charge 0 multiplicity 1
19 atoms
Br -2.864046 1.431499 0.110579
Br 3.0309 1.230188 -0.150124
N  -0.028113 -1.68245 -0.044619
N  2.296349 -1.842927 -0.149826
C  0.065033 1.172745 -0.01974
C  -1.19316 -0.974185 0.013895
C  -1.160525 0.441778 0.026698
C  1.238263 0.388083 -0.079204
C  1.178419 -1.039272 -0.091555
C  0.073313 2.683717 -0.005483
C  -2.469783 -1.780557 0.0615
H  1.094939 3.087642 -0.041542
H  -0.494682 3.078806 -0.867125
H  -0.426021 3.06194 0.904736
H  -2.217029 -2.850986 0.037981
H  -3.0480 -1.562319 0.977859
H  -3.126775 -1.541775 -0.794619
H  3.231186 -1.44615 -0.185978
H  2.155033 -2.849976 -0.153031
