program: Gaussian 09
title: 000018935
version: EM64L-G09RevD.01
frameworkgroup: C1[X(C12H18O)]
method: RPBEPBE
basis: SDD
operation: Freq
keyword: #pfreq=noraman
keyword: PBEPBE/SDD
title: #p freq=noraman PBEPBE/SDD
converged: YES YES NO NO
title: Mulliken charges:
elementType: O C C C C C C C C C C C C H H H H H H H H H H H H H H H H H H
charge: -0.450552 0.109421 0.471003 -0.235504 0.564866 -0.415517 -0.406109 -0.482660 -0.442078 -0.737577 -0.700848 -0.693358 -0.692842 0.209099 0.246013 0.222572 0.231333 0.228841 0.237223 0.199589 0.235323 0.231287 0.220686 0.211705 0.210160 0.212620 0.228765 0.227465 0.212765 0.210619 0.335690
chargesum: 0.00000
title: Mulliken charges with hydrogens summed into heavy atoms:
elementType: O C C C C C C C C C C C C
charge: -0.114862 0.109421 0.471003 -0.026405 0.564866 -0.169504 -0.183537 -0.251327 -0.213238 -0.065443 -0.037170 -0.041813 -0.041992
polarizability: 1.78528145e+02 9.31337000e-01 1.24564205e+02 -1.12563557e+00 -2.30416738e+00 9.43347212e+01
1716.lowfreq: -5.6661 -0.0003 0.0002 0.0002 2.5375 12.7736 32.0627 43.2404 73.0177
frequency: 31.3274 43.0988 72.9546 140.4097 152.8698 171.8106 215.1446 227.4041 230.7190 246.9729 268.0573 279.8286 295.7867 336.7009 348.6315 370.7346 403.9815 451.9100 467.9005 485.9182 533.1876 578.2048 630.7619 642.9899 756.9367 757.8427 820.8654 835.6172 846.3279 890.7285 909.1453 917.5410 930.2027 954.1510 955.7505 970.3289 994.5264 1010.1640 1050.9657 1091.8844 1106.4529 1112.9641 1132.8314 1155.1792 1157.7468 1201.2730 1226.3838 1232.9421 1296.7231 1308.9977 1315.8223 1335.2345 1376.7134 1376.8292 1382.4160 1394.6977 1395.8821 1411.7343 1455.2855 1465.2407 1467.5637 1468.0435 1473.6762 1479.6638 1485.1108 1488.8528 1507.9531 1578.2442 1622.6512 2973.4730 2976.3593 2979.5576 2983.0509 2997.7341 3065.9654 3073.2897 3077.2441 3077.8954 3081.4989 3089.7357 3097.5163 3099.2708 3102.6443 3114.5765 3130.4634 3156.7976 3550.8625
redmass: 2.8015 3.6542 3.3877 2.5396 2.9857 1.2250 1.0807 1.1534 1.9917 1.3939 2.3938 1.2431 2.2775 2.9915 2.5058 2.7249 2.8180 2.9852 3.8061 3.0894 2.8328 2.3338 4.3416 4.4189 3.7592 4.1237 3.2769 1.5414 1.3443 2.5658 2.1127 1.1867 1.5658 1.4985 1.3406 1.3885 1.3064 3.1347 1.6008 1.6776 1.9099 2.5478 1.5800 2.3036 1.7262 1.1338 1.9239 2.5736 1.6271 1.3241 1.8685 1.7917 1.1964 1.2509 3.2867 1.2406 1.2584 2.5260 1.0675 1.0537 1.0459 1.0497 1.0771 1.0491 1.0962 1.0499 2.2517 6.4398 6.3399 1.0349 1.0354 1.0842 1.0351 1.0357 1.1001 1.0992 1.1005 1.0986 1.0997 1.1003 1.0879 1.0990 1.0998 1.0893 1.0946 1.0937 1.0658
irintensity: 0.1585 0.2397 0.1559 15.9414 1.2257 119.9643 0.2354 4.7537 6.3090 0.8440 6.7376 10.0600 0.9172 2.6924 0.2063 5.2872 0.0283 0.4386 2.0090 5.2951 1.8955 35.6405 3.4781 1.6362 1.5620 1.7386 16.3544 41.4633 19.0365 2.4871 16.0108 2.4135 6.1618 0.0123 0.2716 0.2028 1.4544 12.7230 31.3184 16.4866 49.8123 1.2561 43.8082 16.2003 2.8873 1.1595 2.3895 24.0517 8.3416 0.7198 88.7973 17.0718 13.2745 26.6631 6.7260 26.1532 3.9883 17.6045 2.0442 8.7926 4.9064 1.3068 2.8439 15.7941 9.9193 15.3266 22.4723 1.5579 1.7740 31.3120 36.3752 17.7807 21.0892 14.4058 0.3640 105.7041 24.2081 24.6325 42.2730 16.6742 8.7619 51.2923 40.0811 17.1262 25.0391 11.7087 5.2451
temp: 298.150 k
press: 1.00000 atm
elementType: 8 6 6 6 6 6 6 6 6 6 6 6 6 1 1 1 1 1 1 1 1 1 1 1 1 1 1 1 1 1 1
symmnumber: 1
zpe: 701976.6 jmol-1
zpe.correction: 0.267369 hartree
zpe.thermalcorrener: 0.281952 hartree
zpe.thermalcorrenthalpy: 0.282896 hartree
zpe.thermalcorrgfe: 0.226200 hartree
zpe.sumelectzpe: -542.295516 hartree
zpe.sumelectthermal: -542.280933 hartree
zpe.sumelectthermalent: -542.279989 hartree
zpe.sumelectthermalfe: -542.336685 hartree
dipole: -1.9324 -0.3329 -1.1976
dipole: 2.2977
quadrupole: -81.5675 -73.0980 -85.1253
quadrupole: -0.1807 -5.5964 -1.5925
quadrupole: -1.6372 6.8322 -5.1950 -0.1807 -5.5964 -1.5925
hfenergy: -542.5628851 hartree
pointgroup: C01 [X(C12H18O1)]
dipole: -0.7638365 -0.1373356 -0.4635397 debye
polarizability: 178.4922779|1.140898|124.542799|-1.8695328|-2.5122|94.3919938 unknown
InChI: InChI=1S/C12H18O/c1-9(2)10-5-7-11(8-6-10)12(3,4)13/h5-9,13H,1-4H3
charge 0 multiplicity 1
31 atoms
O  3.144273 -0.670776 1.28069
C  2.718109 -0.081446 -0.030313
C  1.18205 0.0582 -0.051412
C  -3.224114 0.324586 -0.004427
C  -1.696614 0.227326 -0.019194
C  0.520834 1.307343 -0.12077
C  0.371356 -1.108461 0.029689
C  -0.890754 1.387313 -0.107355
C  -1.034674 -1.027215 0.049912
C  3.46956 1.258303 -0.070015
C  3.209151 -1.005302 -1.173594
C  -3.821059 -0.240075 1.312558
C  -3.852625 -0.376764 -1.238729
H  -3.490246 1.399819 -0.058573
H  1.103049 2.231764 -0.185179
H  0.838561 -2.102092 0.063451
H  -1.374086 2.370913 -0.164874
H  -1.62306 -1.950672 0.114592
H  4.550272 1.061003 0.029979
H  3.296313 1.791247 -1.021556
H  3.166773 1.902735 0.772306
H  4.300738 -1.145455 -1.087341
H  2.981403 -0.565321 -2.161826
H  2.73045 -2.000281 -1.130967
H  -3.603158 -1.319412 1.417211
H  -4.919891 -0.115474 1.325614
H  -3.402309 0.276159 2.195012
H  -3.45832 0.043538 -2.181362
H  -4.951969 -0.255557 -1.236672
H  -3.632641 -1.460743 -1.233838
H  2.553627 -1.4397 1.489985
