program: Gaussian 09
title: 000223247
version: EM64L-G09RevD.01
frameworkgroup: C1[X(C19H29NOS)]
method: RPBEPBE
basis: SDD
operation: Freq
keyword: #p
keyword: freq=noraman
keyword: PBEPBE/SDD
title: #p freq=noraman PBEPBE/SDD
converged: YES YES NO NO
title: Mulliken charges:
elementType: S O N C C C C C C C C C C C C C C C C C C C H H H H H H H H H H H H H H H H H H H H H H H H H H H H H
charge: 0.149242 -0.185160 -0.094372 -0.429130 -0.450732 0.047135 -0.450747 -0.435425 -0.722629 -0.740617 -0.305398 -0.418687 -0.014103 -0.134583 0.498032 -0.720041 -0.716108 -0.429989 -0.375699 -0.225735 -0.240075 -0.244815 0.210207 0.238059 0.249977 0.227738 0.238032 0.220265 0.212514 0.217643 0.227960 0.304285 0.270359 0.222181 0.218250 0.234556 0.243512 0.209791 0.224632 0.225770 0.214769 0.217950 0.208681 0.216235 0.206039 0.214556 0.229363 0.256459 0.226090 0.225246 0.228519
chargesum: 0.00000
title: Mulliken charges with hydrogens summed into heavy atoms:
elementType: S O N C C C C C C C C C C C C C C C C C C C
charge: 0.149242 -0.185160 -0.094372 0.019136 0.026983 0.285167 -0.017968 0.010178 -0.147985 -0.065630 -0.061885 0.015736 0.211666 -0.134583 0.498032 -0.078641 -0.079279 -0.200626 -0.119239 0.000355 -0.014829 -0.016295
polarizability: 2.50634205e+02 -7.01500376e+00 2.26760177e+02 -5.91081808e+00 -6.82577850e+00 2.12550452e+02
1716.lowfreq: -8.2351 -5.4402 -0.0022 -0.0018 -0.0017 8.9653 15.1222 20.9382 29.4090
frequency: 13.0017 20.6506 29.3203 31.6148 43.2852 46.4740 56.3165 67.0848 71.3602 94.6604 97.6100 128.3749 168.0434 175.4134 199.7785 201.2719 215.6748 232.3972 244.7510 263.8312 289.3412 291.5697 315.3116 359.6443 374.3183 387.2517 403.4440 405.5838 427.2912 458.7282 462.5344 473.6679 498.4113 575.6226 596.7560 615.4687 642.9728 646.5220 691.8493 701.8653 732.1207 739.9757 758.6427 791.5583 802.6617 833.3720 841.5774 850.7668 853.2464 883.6555 892.2996 896.3093 911.8972 912.7652 920.0098 937.4632 947.3563 959.7509 974.3343 975.9996 986.9125 993.9844 995.8101 1018.7239 1030.9837 1032.0954 1045.9723 1068.1256 1076.0535 1090.8116 1099.5576 1122.6524 1132.1047 1162.2956 1169.7197 1172.0015 1176.3693 1189.9909 1192.8810 1201.0430 1210.7578 1216.1294 1219.2425 1255.2835 1264.0586 1273.0681 1284.1812 1290.6547 1296.7804 1307.7054 1316.5504 1324.6195 1334.4557 1338.0634 1339.3616 1344.2839 1347.2548 1376.6731 1381.1875 1383.6956 1393.8548 1420.9347 1442.1063 1457.2450 1463.0821 1467.5069 1467.5604 1471.5299 1473.0628 1477.6478 1480.0298 1481.1636 1486.8199 1488.5449 1496.4001 1591.8774 1606.8949 1616.7974 2894.5192 2966.6009 2969.3576 2971.3724 2979.6899 2983.1081 2983.4402 2992.8853 2996.2021 3015.7536 3018.0857 3043.7976 3044.6558 3053.7591 3058.8117 3067.8172 3068.0423 3072.0653 3072.2095 3077.7799 3081.8470 3087.6137 3102.8767 3116.4060 3124.5006 3125.4058 3137.9794 3148.9436 3163.4132
redmass: 4.4105 4.6856 2.6749 3.8559 4.0075 3.6366 3.3514 2.9866 2.5456 3.0438 3.0289 5.4658 2.4714 3.2464 3.2417 1.3543 2.8860 1.3720 2.0728 2.8027 1.8634 2.2365 4.4041 2.9963 2.1439 2.3828 2.4237 2.3450 2.0914 2.6034 3.1803 7.5273 4.9517 3.2597 2.6601 6.4073 4.2895 5.8026 3.2580 1.8682 2.4402 2.2496 3.1730 2.6674 1.5594 1.6677 2.8204 1.2572 1.7431 3.3699 1.6992 2.0397 2.5656 1.2000 1.4880 1.6262 1.6538 1.7658 1.3953 1.9637 4.3108 1.4567 3.7059 2.5864 2.2022 2.3539 2.1939 1.7603 1.6294 1.7336 2.5207 1.8258 2.2398 2.2180 1.3145 1.0657 1.8073 1.1143 2.4929 1.3763 1.2398 1.4339 1.2336 1.2835 1.1903 1.2551 1.3198 1.5234 1.3057 1.2860 1.2066 1.3698 1.3814 1.4598 1.3710 1.3946 1.3087 1.2164 1.2293 6.4248 1.2137 1.0936 2.1354 1.0787 1.0791 1.0516 1.0681 1.0612 1.0576 1.0839 2.2019 1.0563 1.0801 1.0500 1.0700 6.1581 6.2351 7.7900 1.0827 1.0364 1.0489 1.0544 1.0368 1.0705 1.0762 1.0643 1.0601 1.0634 1.0857 1.0604 1.0952 1.1015 1.0993 1.0987 1.0994 1.1015 1.0988 1.0991 1.0999 1.1038 1.0951 1.0868 1.1071 1.0865 1.0918 1.0958 1.1015
irintensity: 0.2295 0.2110 0.0430 0.3639 0.4304 0.2415 0.1268 0.1994 0.3287 0.7738 0.3350 1.2346 1.3732 0.5389 2.0228 2.4015 3.7926 0.4638 2.4713 1.7317 0.5950 0.7391 0.2431 5.7254 4.2633 1.0534 0.3231 0.2124 3.7191 4.7346 1.0664 9.6549 4.7571 18.4343 12.1900 0.5733 7.8177 10.0414 32.8297 33.5393 140.8995 8.6352 0.6963 11.4523 4.2126 2.0915 27.1452 0.8847 2.9220 15.2733 4.9899 13.1084 1.6174 4.0348 5.6358 11.8948 6.7770 3.1193 0.1421 18.3640 33.4938 2.9578 57.6877 85.9239 9.1930 4.1865 4.4069 10.2058 7.7552 8.0345 21.2565 4.6322 6.0726 25.6426 19.2082 0.0406 15.9096 0.0887 1.4362 9.7140 4.1796 5.6355 4.0419 15.0236 5.4968 24.7458 5.3289 9.8876 3.8012 14.8917 0.3079 18.9466 7.9037 3.4844 4.9710 3.4671 3.1717 20.1119 37.1409 0.8212 18.2546 13.6888 8.4341 2.3783 5.8159 3.3322 10.5183 7.8677 1.8248 14.3136 18.2093 5.9598 13.6258 23.4974 4.9809 5.8709 26.3722 82.8084 41.3443 33.5206 21.4993 17.3323 18.8438 62.8939 27.8283 30.7909 52.7699 46.0272 3.4398 17.6480 12.6973 17.3984 12.6860 70.5686 34.2238 51.2575 57.5044 21.3667 27.0732 68.4922 29.4111 7.3235 2.6959 0.3543 20.6277 26.1442 21.9299
temp: 298.150 k
press: 1.00000 atm
elementType: 16 8 7 6 6 6 6 6 6 6 6 6 6 6 6 6 6 6 6 6 6 6 1 1 1 1 1 1 1 1 1 1 1 1 1 1 1 1 1 1 1 1 1 1 1 1 1 1 1 1 1
symmnumber: 1
zpe: 1152595.5 jmol-1
zpe.correction: 0.439000 hartree
zpe.thermalcorrener: 0.463239 hartree
zpe.thermalcorrenthalpy: 0.464183 hartree
zpe.thermalcorrgfe: 0.381147 hartree
zpe.sumelectzpe: -1267.744537 hartree
zpe.sumelectthermal: -1267.720299 hartree
zpe.sumelectthermalent: -1267.719355 hartree
zpe.sumelectthermalfe: -1267.802390 hartree
dipole: -0.5558 1.2809 0.5351
dipole: 1.4953
quadrupole: -134.6454 -138.9599 -139.9536
quadrupole: 2.8697 -1.2867 -0.0684
quadrupole: 3.2076 -1.1069 -2.1007 2.8697 -1.2867 -0.0684
hfenergy: -1268.1835374 hartree
pointgroup: C01 [X(C19H29N1O1S1)]
dipole: 0.2816305 -0.418029 0.303367 debye
polarizability: 251.9797047|-2.5720094|227.8014197|5.8804841|4.383035|210.1637102 unknown
InChI: InChI=1S/C19H29NOS/c1-15(2)13-18(17-9-5-4-6-10-17)19(21)22-14-16(3)20-11-7-8-12-20/h4-6,9-10,15-16,18H,7-8,11-14H2,1-3H3
charge 0 multiplicity 1
51 atoms
S  -0.951248 2.204037 1.129843
O  -0.494633 0.785857 -1.174922
N  -4.49542 0.474728 -0.163594
C  -5.611382 -0.420978 0.252657
C  -4.078915 -0.094669 -1.486477
C  -3.343305 0.645788 0.78029
C  -5.164407 -1.867334 -0.124896
C  -4.286484 -1.654067 -1.399824
C  -2.681576 1.99175 0.386034
C  -3.762833 0.670701 2.261625
C  1.52573 1.232435 0.174336
C  2.324677 1.792973 -1.045255
C  3.859811 1.85962 -0.836143
C  0.026989 1.287125 -0.152066
C  1.930337 -0.199907 0.547684
C  4.257494 2.816754 0.312898
C  4.542899 2.285496 -2.158035
C  2.453686 -0.475711 1.835522
C  1.797987 -1.265865 -0.380383
C  2.849726 -1.785754 2.189815
C  2.191073 -2.575159 -0.027034
C  2.721679 -2.840456 1.257661
H  -6.505237 -0.141447 -0.340009
H  -5.865878 -0.291802 1.314906
H  -3.034526 0.175186 -1.716349
H  -4.727431 0.32785 -2.276935
H  -2.585781 -0.16285 0.644637
H  -4.56317 -2.304126 0.69436
H  -6.023258 -2.538165 -0.304659
H  -4.792533 -2.029953 -2.306918
H  -3.321723 -2.184017 -1.315895
H  -2.550317 2.062707 -0.705017
H  -3.279249 2.846102 0.743215
H  -4.103955 -0.317855 2.615448
H  -4.572177 1.406281 2.426469
H  -2.895349 0.963259 2.880383
H  1.700188 1.883526 1.050377
H  1.946486 2.810535 -1.275752
H  2.097769 1.163567 -1.926689
H  4.215204 0.84132 -0.577272
H  5.357587 2.883381 0.40155
H  3.869301 2.478704 1.291034
H  3.870938 3.837439 0.125389
H  4.294855 1.589402 -2.980984
H  4.217673 3.299498 -2.462376
H  5.643077 2.303869 -2.048152
H  2.549687 0.337451 2.565727
H  1.369357 -1.070419 -1.369576
H  3.254785 -1.981458 3.189129
H  2.081004 -3.389812 -0.751916
H  3.027388 -3.857038 1.529538
