program: Gaussian 09
title: 000223244
version: EM64L-G09RevD.01
frameworkgroup: C1[X(C14H11NO5)]
method: RPBEPBE
basis: SDD
operation: Freq
keyword: #p
keyword: freq=noraman
keyword: PBEPBE/SDD
title: #p freq=noraman PBEPBE/SDD
converged: YES YES NO NO
title: Mulliken charges:
elementType: O O O O O N C C C C C C C C C C C C C C H H H H H H H H H H H
charge: -0.276720 -0.244682 -0.294969 -0.160283 -0.203361 -0.031871 0.274591 0.060780 0.209415 0.204776 -0.141740 -0.389585 0.275679 -0.385791 0.123653 -0.797936 0.207890 -0.760879 0.251460 -0.742578 0.264468 0.257170 0.225943 0.271373 0.272209 0.267433 0.252293 0.251726 0.253974 0.251532 0.254031
chargesum: 0.00000
title: Mulliken charges with hydrogens summed into heavy atoms:
elementType: O O O O O N C C C C C C C C C C C C C C
charge: -0.276720 -0.244682 -0.294969 -0.160283 -0.203361 -0.031871 0.274591 0.060780 0.209415 0.204776 -0.141740 -0.125117 0.275679 -0.128622 0.123653 -0.028411 0.207890 0.010573 0.251460 0.016959
polarizability: 2.93150994e+02 5.14509203e+00 1.83160463e+02 7.99488998e+00 3.99536085e+00 9.22852630e+01
1716.lowfreq: -6.7578 -2.3847 -1.7533 -0.0006 -0.0003 0.0008 37.7736 48.6533 56.4538
frequency: 37.7688 48.6485 56.4494 74.2782 82.5166 98.0190 109.1274 143.2908 151.9570 155.6798 168.2560 191.0290 241.6490 266.2365 286.0872 301.5068 309.5611 342.8885 377.7833 384.0767 423.6311 461.0727 511.4014 528.5464 542.7946 554.4046 581.5683 594.4850 622.9625 636.0017 644.3441 673.1955 690.2284 725.3549 740.8077 764.5344 793.5766 815.0441 824.6641 844.3163 892.5935 936.8297 958.1108 987.2031 991.7090 1040.0680 1047.0067 1047.6844 1050.7366 1066.4545 1105.4860 1156.5121 1167.8421 1190.4365 1201.9559 1224.1126 1293.4476 1359.9774 1384.9004 1391.2683 1400.4799 1401.8894 1428.7884 1452.0822 1452.7775 1454.8449 1455.0412 1458.1133 1468.0043 1482.2492 1549.0063 1576.3304 1595.4127 1628.0933 1684.8719 1736.1484 2992.2729 3000.1606 3010.0899 3073.0732 3079.9574 3097.7543 3120.2274 3132.8678 3146.4823 3161.1816 3182.9191
redmass: 5.6734 1.9678 3.4452 4.5015 1.7512 1.0712 6.9104 1.0976 4.1424 4.5074 4.5609 8.2173 4.6129 4.2373 5.6301 3.9083 5.0662 6.5040 4.4982 6.1882 6.2563 5.0227 7.2032 3.8801 4.9787 3.6500 6.1835 5.9869 8.1744 6.4675 6.8883 5.9591 6.1450 6.6883 7.0093 6.6073 7.2706 5.4444 2.4564 3.4935 6.0283 3.3361 1.3514 2.0769 2.2972 1.6504 1.6321 1.4741 2.4075 3.2393 3.3007 2.4870 1.9234 5.4496 3.3170 2.7349 9.1943 3.5820 1.2377 6.1085 1.3094 1.2410 4.3411 1.0656 1.0486 1.0455 2.5763 1.0852 1.0776 1.3615 8.1467 8.3427 7.8768 9.0075 10.1597 12.8233 1.0383 1.0381 1.0369 1.0969 1.0979 1.0972 1.0987 1.0985 1.1013 1.0886 1.0979
irintensity: 0.8803 2.6318 0.6360 0.4704 1.0681 0.2454 0.8159 0.8887 0.4074 1.6630 1.4084 2.8538 2.7018 2.3969 1.7751 3.3936 3.3280 2.9007 2.5322 1.9673 0.0578 3.4592 0.8854 1.0559 13.2107 9.8383 6.8770 13.3166 5.7355 9.2638 2.5702 13.6079 7.1357 18.6250 6.9034 5.7192 54.7289 4.9701 40.2239 91.8578 199.5340 9.0550 0.1769 111.4592 14.2763 8.8981 37.4747 5.2294 170.3575 62.5188 14.8674 498.3125 62.4968 34.7709 7.9675 16.1337 12.1525 33.8377 64.9052 1.5596 27.2032 7.7792 41.0449 28.3015 17.4030 20.8829 14.7281 16.3017 25.7810 27.3256 5.7120 58.6607 78.5299 67.6570 150.9927 574.4970 13.0963 9.2798 0.9229 10.2471 7.5644 5.2596 3.4442 2.0177 9.5067 0.8698 3.2890
temp: 298.150 k
press: 1.00000 atm
elementType: 8 8 8 8 8 7 6 6 6 6 6 6 6 6 6 6 6 6 6 6 1 1 1 1 1 1 1 1 1 1 1
symmnumber: 1
zpe: 583270.4 jmol-1
zpe.correction: 0.222156 hartree
zpe.thermalcorrener: 0.240413 hartree
zpe.thermalcorrenthalpy: 0.241357 hartree
zpe.thermalcorrgfe: 0.175051 hartree
zpe.sumelectzpe: -969.557383 hartree
zpe.sumelectthermal: -969.539126 hartree
zpe.sumelectthermalent: -969.538182 hartree
zpe.sumelectthermalfe: -969.604489 hartree
dipole: -2.1892 -6.0850 -1.5705
dipole: 6.6548
quadrupole: -88.2380 -120.8523 -119.4263
quadrupole: -17.8857 6.7753 -1.9856
quadrupole: 21.2675 -11.3467 -9.9208 -17.8857 6.7753 -1.9856
hfenergy: -969.7795391 hartree
pointgroup: C01[X(C14H11N1O5)]
dipole: -0.9759195 -2.299376 -0.7844828 debye
polarizability: 293.4695479|-0.5446102|181.8961086|7.1229747|10.2437462|93.2310634 unknown
InChI: InChI=1S/C14H11NO5/c1-6-10(19-8(3)16)5-4-9-12(6)20-14(17)11-13(9)18-7(2)15-11/h4-5H,1-3H3
charge 0 multiplicity 1
31 atoms
O  0.543131 1.77629 0.029356
O  2.824172 -1.673928 -0.060851
O  -3.700062 -0.516749 -0.576327
O  2.493342 3.011666 0.273061
O  -4.135444 0.176167 1.626126
N  4.033951 0.281474 0.192143
C  0.499409 -0.691494 -0.171953
C  -0.165857 0.575369 -0.122158
C  1.922162 -0.607661 -0.048815
C  -1.578053 0.688301 -0.231383
C  2.650781 0.57481 0.103901
C  -0.260083 -1.879143 -0.338714
C  -2.283297 -0.527561 -0.383881
C  -1.653836 -1.794858 -0.445991
C  2.014864 1.878348 0.151632
C  -2.263579 2.034178 -0.193883
C  4.12247 -1.032333 0.095232
C  5.309883 -1.925707 0.120523
C  -4.557394 -0.134122 0.499713
C  -5.99174 -0.186849 0.031472
H  0.251049 -2.845192 -0.37937
H  -2.272407 -2.686589 -0.576694
H  -3.118842 2.05941 -0.891785
H  -2.65237 2.238472 0.820812
H  -1.557762 2.836901 -0.454213
H  6.214071 -1.311613 0.244593
H  5.247846 -2.647622 0.954105
H  5.393438 -2.504297 -0.816587
H  -6.143406 0.51918 -0.803513
H  -6.662848 0.070741 0.862853
H  -6.231187 -1.195289 -0.347009
