program: Gaussian 09
title: 000223243
version: EM64L-G09RevD.01
frameworkgroup: C1[X(C13H17NO3)]
method: RPBEPBE
basis: SDD
operation: Freq
keyword: #p
keyword: freq=noraman
keyword: PBEPBE/SDD
title: #p freq=noraman PBEPBE/SDD
converged: YES YES NO NO
title: Mulliken charges:
elementType: O O O N C C C C C C C C C C C C C H H H H H H H H H H H H H H H H H
charge: -0.271357 -0.254349 -0.252091 -0.450036 0.012944 0.420123 0.405297 0.553464 -0.597594 -0.725187 -0.812385 -0.809702 0.122192 -0.259590 0.213651 -0.668803 -0.800161 0.313457 0.226620 0.254695 0.232158 0.225516 0.214591 0.232508 0.265204 0.313217 0.235439 0.220762 0.217853 0.225554 0.250958 0.237741 0.269924 0.237387
chargesum: 0.00000
title: Mulliken charges with hydrogens summed into heavy atoms:
elementType: O O O N C C C C C C C C C C C C C
charge: -0.271357 -0.254349 -0.252091 -0.136818 0.012944 0.420123 0.405297 0.553464 -0.284137 -0.498567 -0.100016 -0.097399 0.122192 0.196611 0.213651 0.025561 -0.055109
polarizability: 2.57284673e+02 1.96716199e+00 1.67642148e+02 -1.75693813e-01 -1.39212447e+00 9.11251374e+01
1716.lowfreq: -70.4626 -7.6030 -4.1098 0.0003 0.0004 0.0007 7.4077 33.2650 42.7612
frequency: -70.4546 33.2183 42.7588 54.9765 63.5990 89.0668 97.9025 122.1811 153.2097 171.4142 181.6998 203.7805 225.8248 240.0231 242.6003 274.6050 287.7187 308.9403 331.0152 382.4356 417.4885 430.7044 513.8057 529.8808 535.1220 553.9470 566.5038 575.2454 615.0128 660.0918 692.2709 708.7312 747.4694 773.7377 816.5222 827.0827 869.9843 902.2324 927.6734 954.0679 977.7658 990.0110 996.6843 1031.1668 1034.1763 1047.0621 1050.3895 1051.2539 1058.0221 1093.7781 1152.2055 1174.6158 1228.4715 1235.9193 1261.7334 1278.1139 1316.0563 1352.4853 1370.3211 1376.4726 1387.8805 1394.7156 1403.1399 1409.4901 1441.1198 1449.4983 1455.3127 1458.5464 1464.3812 1467.9172 1468.4652 1476.4669 1485.0767 1489.2715 1508.6715 1583.9223 1603.2830 1617.7434 1636.5989 2987.2420 2991.0076 2991.4281 2994.3568 3027.6885 3072.0162 3077.4469 3080.3524 3085.2606 3090.9167 3090.9738 3094.9063 3108.1015 3116.7692 3136.8651 3189.1951 3519.5209
redmass: 1.0438 3.7380 3.7232 5.0580 4.9534 3.8808 3.3292 4.2917 1.0918 1.5894 1.4186 3.3851 2.8409 3.2791 1.5314 4.6677 3.8683 2.9074 3.2550 4.0157 5.0848 3.2986 4.2396 3.0733 4.6550 3.9089 4.3292 3.4631 2.7791 1.3458 4.0014 4.2381 2.9580 4.0186 1.4464 3.6130 1.5180 4.6335 1.3831 2.3957 4.0630 1.7939 2.4710 1.6648 3.8707 1.5743 1.6636 1.6709 2.1847 2.1497 1.6836 2.2771 2.6412 2.3309 1.5209 1.1165 4.6920 1.2892 6.3762 1.2693 1.2375 2.1330 1.2274 1.4084 1.7090 1.1252 1.1052 1.0921 1.0477 1.1203 1.0479 1.1110 1.0549 1.4460 2.2915 5.3713 8.7846 5.2779 5.3561 1.0384 1.0360 1.0368 1.0363 1.0593 1.0983 1.0971 1.0969 1.0977 1.1008 1.1020 1.1007 1.0912 1.1058 1.0979 1.0929 1.0763
irintensity: 0.0737 2.5174 0.7673 6.1450 6.2983 0.0988 1.4257 4.8472 1.2702 4.0323 1.9807 2.1799 0.2143 0.3787 1.6698 0.6444 3.1804 1.6744 17.5847 0.8871 6.3434 2.5456 0.1640 4.8812 0.0973 10.6919 0.6001 3.8560 5.6235 67.3688 12.9412 8.8636 6.6766 0.8428 0.9295 1.8802 25.0657 1.2741 26.6462 24.6411 5.9621 19.6229 5.2072 7.7917 286.7868 8.3534 15.2527 10.1829 59.1547 27.8009 41.8787 87.4459 259.2033 71.6707 65.7533 2.0398 12.4630 4.9047 83.3296 76.1165 26.6774 158.4020 36.3374 17.0314 20.4635 51.1891 28.1887 14.3033 13.0918 13.9684 23.4456 51.9965 20.6188 8.8523 383.6986 28.3250 298.3656 152.8221 109.8673 8.5475 21.2791 25.9385 19.6639 37.1834 14.8647 15.9688 15.4487 45.8489 13.9117 2.9058 18.4061 25.9291 30.2506 7.3611 4.7279 11.9566
temp: 298.150 k
press: 1.00000 atm
elementType: 8 8 8 7 6 6 6 6 6 6 6 6 6 6 6 6 6 1 1 1 1 1 1 1 1 1 1 1 1 1 1 1 1 1
symmnumber: 1
zpe: 724080.4 jmol-1
zpe.correction: 0.275788 hartree
zpe.thermalcorrener: 0.293405 hartree
zpe.thermalcorrenthalpy: 0.294350 hartree
zpe.thermalcorrgfe: 0.229493 hartree
zpe.sumelectzpe: -784.765302 hartree
zpe.sumelectthermal: -784.747684 hartree
zpe.sumelectthermalent: -784.746740 hartree
zpe.sumelectthermalfe: -784.811596 hartree
dipole: -1.1575 2.1869 0.9143
dipole: 2.6379
quadrupole: -78.7890 -100.8982 -104.1907
quadrupole: -22.4755 3.3909 2.4288
quadrupole: 15.8370 -6.2723 -9.5647 -22.4755 3.3909 2.4288
hfenergy: -785.0410898 hartree
pointgroup: C01 [X(C13H17N1O3)]
dipole: 0.4189308 -0.9490689 0.0290518 debye
polarizability: 257.2874709|-1.9764358|157.1213659|1.0113143|26.3591742|101.6431218 unknown
InChI: InChI=1S/C13H17NO3/c1-5-17-13(16)12-8(2)6-11(7-9(12)3)14-10(4)15/h6-7,14H,5H2,1-4H3
charge 0 multiplicity 1
34 atoms
O  -3.050185 0.313623 1.059597
O  -3.193139 -0.938761 -0.894981
O  3.984691 1.483648 0.759652
N  3.270194 -0.634209 0.031319
C  -0.986972 -0.394972 0.030281
C  -0.224103 0.751227 0.427608
C  -0.315611 -1.596689 -0.376659
C  1.854842 -0.50331 0.046093
C  1.188348 0.687258 0.422744
C  1.091979 -1.632191 -0.347343
C  -0.853788 2.074762 0.833257
C  -1.058482 -2.845659 -0.820811
C  -2.481393 -0.377059 -0.02091
C  -4.542437 0.407139 1.073405
C  4.247911 0.31017 0.369659
C  -5.024875 1.594815 0.234463
C  5.677888 -0.21285 0.222242
H  1.779445 1.558138 0.71006
H  1.602991 -2.559013 -0.640398
H  -1.330111 1.997448 1.825652
H  -0.085911 2.865315 0.872017
H  -1.644966 2.39037 0.130852
H  -0.358694 -3.69067 -0.93963
H  -1.839788 -3.141094 -0.097915
H  -1.580732 -2.676391 -1.777822
H  3.618311 -1.547494 -0.271624
H  -4.957958 -0.543285 0.69496
H  -4.781425 0.529791 2.14203
H  -6.123196 1.691769 0.321818
H  -4.567309 2.537184 0.582758
H  -4.777286 1.446659 -0.830045
H  5.857695 -1.083511 0.880161
H  6.374496 0.590136 0.501847
H  5.88907 -0.519396 -0.819237
