program: Gaussian 09
title: 000223228
version: EM64L-G09RevD.01
frameworkgroup: C1[X(C20H26ClNO)]
method: RPBEPBE
basis: SDD
operation: Freq
keyword: #p
keyword: freq=noraman
keyword: PBEPBE/SDD
title: #p freq=noraman PBEPBE/SDD
converged: YES YES NO NO
title: Mulliken charges:
elementType: Cl O N C C C C C C C C C C C C C C C C C C C C H H H H H H H H H H H H H H H H H H H H H H H H H H
charge: -0.070851 -0.475684 -0.201998 -0.327413 -0.431295 -0.381724 -0.520982 -0.196857 -0.338274 -0.356821 0.491626 0.475987 -0.694650 -0.453435 -0.358621 -0.379422 -0.422869 -0.221054 -0.233093 -0.208438 -0.215473 -0.239599 -0.104324 0.194525 0.212871 0.263251 0.212114 0.190995 0.208838 0.223258 0.210522 0.199815 0.189991 0.184878 0.195171 0.201204 0.209514 0.211731 0.218514 0.233296 0.231781 0.365930 0.284704 0.233598 0.227264 0.228619 0.251686 0.251269 0.229924
chargesum: 0.00000
title: Mulliken charges with hydrogens summed into heavy atoms:
elementType: Cl O N C C C C C C C C C C C C C C C C C C C C
charge: -0.070851 -0.109754 -0.201998 0.079983 0.044070 0.018108 -0.087202 0.002958 0.036596 0.039554 0.491626 0.475987 -0.054891 -0.220139 -0.126840 -0.094717 -0.189272 0.006210 -0.004473 0.043248 0.035796 -0.009675 -0.104324
polarizability: 2.84869116e+02 -2.28114661e+01 2.22357087e+02 3.15876387e+00 2.29118302e+01 1.89915854e+02
1716.lowfreq: -3.5683 0.0012 0.0018 0.0020 1.7947 10.5617 14.4680 19.4300 25.6485
frequency: 14.3797 19.2365 25.5562 26.8375 35.0769 43.9536 52.9467 66.7055 89.8767 107.8728 119.3011 125.4907 136.2550 174.3667 176.7548 214.6626 229.7365 231.5485 275.3805 289.4374 306.8384 333.1902 344.3516 366.7343 391.0845 405.8488 408.2635 438.9921 450.5032 486.4475 490.9147 526.3677 564.5443 609.4745 617.3738 624.8271 663.3654 692.6824 710.3796 717.9099 726.7800 746.0346 755.9932 796.3195 813.5504 819.7188 835.0615 842.5847 856.8135 860.0670 885.7039 901.2779 922.4754 946.5654 961.3739 972.4637 982.2031 983.2981 990.9384 998.7571 999.4152 1001.7050 1016.3145 1026.7189 1039.8184 1056.6606 1068.6873 1070.5958 1081.8202 1083.8411 1104.4036 1117.6171 1121.5906 1169.9283 1172.5770 1174.5443 1185.5909 1203.0941 1212.7008 1218.1628 1226.4493 1241.5662 1252.7762 1266.3968 1274.5242 1282.5961 1285.3146 1293.3999 1305.7713 1317.5311 1323.7134 1350.7292 1353.5138 1363.6304 1370.1241 1381.9265 1387.0737 1390.0718 1391.3718 1400.5303 1440.7206 1456.7000 1464.2354 1466.6776 1472.8212 1474.5558 1476.1629 1477.7478 1482.2585 1485.3614 1489.1752 1588.6849 1595.3825 1601.2103 1615.1401 2887.8601 2897.8846 2914.5575 2933.0359 2955.5128 2968.4407 2973.0362 2975.4826 2995.4089 3016.6341 3025.4483 3027.8608 3047.8374 3059.6472 3069.6198 3073.0847 3115.2548 3119.9328 3123.5634 3135.2137 3146.8810 3157.1417 3163.9250 3167.9042 3176.6242 3209.8646
redmass: 6.8655 4.1397 4.2345 4.0125 3.8928 1.7094 5.7399 5.0025 2.8985 2.8460 2.1345 3.6731 6.0144 4.5041 5.3870 3.0473 1.1119 3.7600 6.6308 3.3699 4.5254 2.7984 3.2904 3.7031 3.3857 2.8286 2.9413 2.9305 5.1473 3.5339 3.3916 3.1173 3.1018 3.8996 6.2053 6.7643 5.5049 1.3442 1.8323 2.6988 1.0691 1.6009 1.2011 3.6023 1.9229 2.3325 1.5320 1.2916 1.7672 1.4585 2.3725 2.0412 1.4098 1.3757 1.2719 1.8017 1.3879 1.3909 6.0319 1.8873 2.6376 2.4121 3.5183 2.2402 4.0397 2.8144 2.6171 2.1844 2.1174 1.6949 1.4349 1.9221 2.3896 1.7074 1.0681 1.1915 1.1131 2.2534 2.0387 1.6663 1.4457 1.3676 1.3789 1.2193 1.2581 1.0861 1.1953 1.1279 1.2722 1.3657 1.2963 1.2812 1.6078 1.6126 1.4658 5.1527 4.1620 1.2186 2.5052 1.6172 2.1134 1.1076 1.0745 1.0751 1.1681 1.1023 2.4197 1.0440 1.0794 1.9728 1.0918 7.5204 6.1190 6.3327 6.1638 1.0705 1.0708 1.0808 1.0694 1.0587 1.0593 1.0364 1.0603 1.0976 1.0956 1.0884 1.0969 1.1019 1.0939 1.1008 1.0993 1.0875 1.0897 1.0860 1.0910 1.0960 1.0887 1.1015 1.0950 1.0967 1.0633
irintensity: 0.0203 0.1392 0.1711 0.0843 0.1036 0.0405 0.5561 1.1618 0.5209 0.8192 0.9154 2.2695 0.4136 0.5084 1.4724 0.4133 0.0046 1.0378 1.8732 1.6062 0.9914 1.7558 0.6038 8.6841 2.1546 0.5570 0.0380 0.6632 30.9329 3.1476 7.2445 19.1565 8.2440 1.1400 0.6102 0.8542 12.2103 96.9683 36.0028 28.3989 14.4639 44.6986 7.2195 24.1665 34.2726 6.4543 3.6395 19.2044 26.1676 5.6885 22.5545 2.2714 6.3282 0.2546 3.8674 9.5426 1.5295 2.0582 0.2517 13.2089 30.3491 13.7786 24.4456 5.0290 56.4084 4.1398 47.7772 18.0389 11.5822 29.2785 3.1344 28.5619 1.1910 12.1783 0.4244 6.3494 0.3628 14.4664 5.9272 1.6248 7.1459 16.3327 5.2190 6.1260 8.4887 1.9249 1.3839 4.4731 12.3012 2.2778 3.2803 5.1359 1.6684 3.7202 15.7385 7.8527 9.8757 15.0143 23.8942 36.8858 10.9459 6.3010 1.0835 0.9553 11.8180 4.6354 72.4248 11.8390 0.9226 8.5627 21.4064 2.5604 1.0168 5.0711 2.5266 42.4113 94.8398 48.9321 72.8442 10.6110 13.0463 48.1367 77.3422 2.2204 5.4165 13.6375 9.1226 76.6925 15.9264 94.2119 51.1526 7.5393 13.4326 2.8517 12.8802 39.4137 1.0292 20.6157 5.9267 2.4490 237.7051
temp: 298.150 k
press: 1.00000 atm
elementType: 17 8 7 6 6 6 6 6 6 6 6 6 6 6 6 6 6 6 6 6 6 6 6 1 1 1 1 1 1 1 1 1 1 1 1 1 1 1 1 1 1 1 1 1 1 1 1 1 1
symmnumber: 1
zpe: 1080902.2 jmol-1
zpe.correction: 0.411694 hartree
zpe.thermalcorrener: 0.435367 hartree
zpe.thermalcorrenthalpy: 0.436311 hartree
zpe.thermalcorrgfe: 0.353503 hartree
zpe.sumelectzpe: -1366.019569 hartree
zpe.sumelectthermal: -1365.995896 hartree
zpe.sumelectthermalent: -1365.994952 hartree
zpe.sumelectthermalfe: -1366.077760 hartree
dipole: 4.5241 0.7783 -2.6350
dipole: 5.2931
quadrupole: -159.4378 -139.0937 -142.8990
quadrupole: -8.9817 -0.1381 6.9237
quadrupole: -12.2943 8.0498 4.2445 -8.9817 -0.1381 6.9237
hfenergy: -1366.4312629 hartree
pointgroup: C01 [X(C20H26Cl1N1O1)]
dipole: -1.8203607 -0.1529152 -0.9997595 debye
polarizability: 279.3763218|-29.2648775|226.3035048|-6.2429492|-23.0075897|191.4622298 unknown
InChI: InChI=1S/C20H26ClNO/c1-2-3-7-14-22(15-17-8-5-4-6-9-17)16-20(23)18-10-12-19(21)13-11-18/h4-6,8-13,20,23H,2-3,7,14-16H2,1H3
charge 0 multiplicity 1
49 atoms
Cl 6.894705 0.809049 -0.216208
O  0.281939 0.77511 1.516306
N  -1.32508 0.172022 -0.536167
C  -2.221282 1.332903 -0.820457
C  0.098985 0.420272 -0.890148
C  -3.475576 1.364408 0.076408
C  -1.847518 -1.111633 -1.093268
C  0.766292 1.280218 0.237187
C  -4.390024 2.574869 -0.222432
C  -5.653895 2.603968 0.666897
C  -1.226615 -2.34821 -0.454528
C  2.283095 1.194596 0.161166
C  -6.570689 3.810167 0.369823
C  -0.633109 -3.35387 -1.255569
C  -1.262345 -2.527955 0.952154
C  2.995337 0.288463 0.983092
C  2.997874 1.992205 -0.766355
C  -0.090013 -4.520301 -0.66764
C  -0.720971 -3.689167 1.543285
C  4.398658 0.166148 0.875663
C  4.40109 1.879896 -0.891587
C  -0.132588 -4.690813 0.734307
C  5.078193 0.961622 -0.066672
H  -2.523284 1.346755 -1.896026
H  -1.640134 2.257009 -0.643065
H  0.611297 -0.557172 -0.924547
H  0.222306 0.914231 -1.880156
H  -4.062878 0.432808 -0.051381
H  -3.150916 1.391133 1.135307
H  -2.93866 -1.119488 -0.914589
H  -1.705159 -1.153082 -2.199323
H  0.459082 2.343751 0.113744
H  -3.820276 3.516347 -0.077058
H  -4.696116 2.556587 -1.289668
H  -6.221226 1.661923 0.522436
H  -5.348172 2.622745 1.732564
H  -6.914952 3.797906 -0.681725
H  -6.036971 4.764907 0.536284
H  -7.466056 3.807258 1.018014
H  -0.595142 -3.224608 -2.344689
H  -1.718302 -1.754057 1.580864
H  -0.604541 0.355516 1.268482
H  2.436278 -0.3005 1.715877
H  2.465818 2.717422 -1.39476
H  0.367695 -5.288989 -1.30035
H  -0.755231 -3.814502 2.631372
H  4.951316 -0.529506 1.514024
H  4.954036 2.495676 -1.606789
H  0.289625 -5.591935 1.193002
